id_mutation,date_mutation,numero_disposition,nature_mutation,valeur_fonciere,adresse_numero,adresse_suffixe,adresse_nom_voie,adresse_code_voie,code_postal,code_commune,nom_commune,code_departement,ancien_code_commune,ancien_nom_commune,id_parcelle,ancien_id_parcelle,numero_volume,lot1_numero,lot1_surface_carrez,lot2_numero,lot2_surface_carrez,lot3_numero,lot3_surface_carrez,lot4_numero,lot4_surface_carrez,lot5_numero,lot5_surface_carrez,nombre_lots,code_type_local,type_local,surface_reelle_bati,nombre_pieces_principales,code_nature_culture,nature_culture,code_nature_culture_speciale,nature_culture_speciale,surface_terrain,longitude,latitude
2020-904362,2020-12-29,000001,Vente,75000,,,LA BARGE,B005,63250,63463,Viscomtat,63,,,63463000AK0004,,,,,,,,,,,,,0,,,,,P,prés,,,3620,3.68533,45.84271
2020-904362,2020-12-29,000001,Vente,75000,5026,,LA BARGE,B005,63250,63463,Viscomtat,63,,,63463000AK0005,,,,,,,,,,,,,0,1,Maison,90,3,S,sols,,,740,3.685532,45.8431
2020-904362,2020-12-29,000001,Vente,75000,5026,,LA BARGE,B005,63250,63463,Viscomtat,63,,,63463000AK0005,,,,,,,,,,,,,0,3,Dépendance,,0,S,sols,,,740,3.685532,45.8431
2020-904362,2020-12-29,000001,Vente,75000,,,LA BARGE,B005,63250,63463,Viscomtat,63,,,63463000AK0008,,,,,,,,,,,,,0,,,,,L,landes,,,580,3.685569,45.84332
2020-907421,2020-01-20,000001,Vente,128000,5079,,LA COURTADE,B060,63250,63463,Viscomtat,63,,,63463000AE0036,,,,,,,,,,,,,0,1,Maison,60,3,S,sols,,,740,3.686895,45.838521
2020-907421,2020-01-20,000001,Vente,128000,5079,,LA COURTADE,B060,63250,63463,Viscomtat,63,,,63463000AE0036,,,,,,,,,,,,,0,1,Maison,47,3,S,sols,,,740,3.686895,45.838521
2020-907421,2020-01-20,000001,Vente,128000,,,LA COURTADE,B060,63250,63463,Viscomtat,63,,,63463000AE0037,,,,,,,,,,,,,0,,,,,P,prés,,,1170,3.687138,45.838817
2020-907421,2020-01-20,000001,Vente,128000,,,LA COURTADE,B060,63250,63463,Viscomtat,63,,,63463000AE0039,,,,,,,,,,,,,0,,,,,E,eaux,MARE,Mare,780,3.687991,45.837902
2020-907910,2020-03-03,000001,Vente,140000,5658,,POUZET,B171,63250,63463,Viscomtat,63,,,63463000AH0220,,,,,,,,,,,,,0,4,Local industriel. commercial ou assimilé,350,0,S,sols,,,1620,3.674625,45.84671
2020-907910,2020-03-03,000001,Vente,140000,,,POUZET,B171,63250,63463,Viscomtat,63,,,63463000AH0248,,,,,,,,,,,,,0,,,,,T,terres,,,1064,3.67462,45.846473
2020-907910,2020-03-03,000001,Vente,140000,,,POUZET,B171,63250,63463,Viscomtat,63,,,63463000AH0250,,,,,,,,,,,,,0,,,,,PA,pâtures,,,98,3.674601,45.846347
2020-907912,2020-03-05,000001,Vente,5000,,,CORNILLON,B055,63250,63463,Viscomtat,63,,,63463000AH0238,,,,,,,,,,,,,0,,,,,J,jardins,,,199,3.676132,45.844555
2020-907912,2020-03-05,000001,Vente,5000,5054,,CORNILLON,B055,63250,63463,Viscomtat,63,,,63463000AH0240,,,,,,,,,,,,,0,1,Maison,102,4,S,sols,,,256,3.676296,45.844601
2020-908014,2020-04-23,000001,Vente,34000,,,BAZARD,B008,63250,63463,Viscomtat,63,,,63463000AV0028,,,,,,,,,,,,,0,,,,,BR,futaies résineuses,,,1432,3.681114,45.814385
2020-908014,2020-04-23,000001,Vente,34000,,,BAZARD,B008,63250,63463,Viscomtat,63,,,63463000AV0029,,,,,,,,,,,,,0,,,,,BR,futaies résineuses,,,4525,3.683952,45.813251
2020-908014,2020-04-23,000001,Vente,34000,,,BAZARD,B008,63250,63463,Viscomtat,63,,,63463000AV0045,,,,,,,,,,,,,0,,,,,BR,futaies résineuses,,,30246,3.684571,45.815348
2020-908014,2020-04-23,000001,Vente,34000,,,BAZARD,B008,63250,63463,Viscomtat,63,,,63463000AV0048,,,,,,,,,,,,,0,,,,,BR,futaies résineuses,,,12210,3.68666,45.812938
2020-908014,2020-04-23,000001,Vente,34000,,,BAZARD,B008,63250,63463,Viscomtat,63,,,63463000AV0050,,,,,,,,,,,,,0,,,,,BR,futaies résineuses,,,12640,3.68584,45.811771
2020-908014,2020-04-23,000001,Vente,34000,,,BAZARD,B008,63250,63463,Viscomtat,63,,,63463000AV0052,,,,,,,,,,,,,0,,,,,BR,futaies résineuses,,,12533,3.685011,45.810659
2020-908159,2020-06-04,000001,Vente,62000,,,LE CHEIX,B038,63250,63463,Viscomtat,63,,,63463000AC0106,,,,,,,,,,,,,0,,,,,S,sols,,,117,3.665579,45.830034
2020-908159,2020-06-04,000001,Vente,62000,,,LE CHEIX,B038,63250,63463,Viscomtat,63,,,63463000AC0109,,,,,,,,,,,,,0,,,,,S,sols,,,280,3.665865,45.83008
2020-908159,2020-06-04,000001,Vente,62000,5268,,LE CHEIX,B038,63250,63463,Viscomtat,63,,,63463000AC0117,,,,,,,,,,,,,0,1,Maison,120,5,S,sols,,,1340,3.665352,45.829759
2020-908159,2020-06-04,000001,Vente,62000,,,LE CHEIX,B038,63250,63463,Viscomtat,63,,,63463000AC0118,,,,,,,,,,,,,0,,,,,J,jardins,,,1000,3.66556,45.829564
2020-908159,2020-06-04,000001,Vente,62000,5267,,LE CHEIX,B038,63250,63463,Viscomtat,63,,,63463000AC0140,,,,,,,,,,,,,0,3,Dépendance,,0,S,sols,,,30,3.665968,45.828884
2020-908259,2020-06-04,000001,Vente,5000,,,LOULE,B127,63250,63463,Viscomtat,63,,,63463000AO0104,,,,,,,,,,,,,0,,,,,L,landes,,,1350,3.707534,45.831113
2020-908259,2020-06-04,000001,Vente,5000,,,LOULE,B127,63250,63463,Viscomtat,63,,,63463000AO0105,,,,,,,,,,,,,0,,,,,PA,pâtures,,,50960,3.708983,45.831157
2020-908484,2020-06-26,000001,Vente,56500,5644,,LIGNIERES VIEILLES,B117,63250,63463,Viscomtat,63,,,63463000AD0385,,,,,,,,,,,,,0,4,Local industriel. commercial ou assimilé,580,0,S,sols,,,2526,3.670741,45.844786
2020-908498,2020-06-25,000001,Vente,350,,,LA GOUTTE,B095,63250,63463,Viscomtat,63,,,63463000AO0085,,,,,,,,,,,,,0,,,,,BR,futaies résineuses,,,3550,3.702144,45.829236
2020-908526,2020-07-15,000001,Vente,20000,5045,,CORNILLON,B055,63250,63463,Viscomtat,63,,,63463000AH0258,,,,,,,,,,,,,0,1,Maison,78,3,S,sols,,,79,3.676449,45.845018
2020-908778,2020-08-03,000001,Vente,700,,,LE PUY,B190,63250,63463,Viscomtat,63,,,63463000AZ0103,,,,,,,,,,,,,0,,,,,BR,futaies résineuses,,,1500,3.655213,45.82556
2020-908778,2020-08-03,000001,Vente,700,,,LE PUY,B190,63250,63463,Viscomtat,63,,,63463000AZ0191,,,,,,,,,,,,,0,,,,,BF,futaies feuillues,,,4543,3.655437,45.826328
2020-908788,2020-08-03,000001,Vente,64000,,,FONTBONNE,B075,63250,63463,Viscomtat,63,,,63463000AT0185,,,,,,,,,,,,,0,,,,,T,terres,,,90,3.696681,45.818886
2020-908788,2020-08-03,000001,Vente,64000,5532,,FONTBONNE,B075,63250,63463,Viscomtat,63,,,63463000AT0314,,,,,,,,,,,,,0,1,Maison,80,3,S,sols,,,208,3.696303,45.818519
2020-908788,2020-08-03,000001,Vente,64000,,,FONTBONNE,B075,63250,63463,Viscomtat,63,,,63463000AT0315,,,,,,,,,,,,,0,,,,,S,sols,,,42,3.696222,45.818374
2020-909279,2020-10-07,000001,Vente,60000,,,L OJARDIE,B146,63250,63463,Viscomtat,63,,,63463000AX0409,,,,,,,,,,,,,0,,,,,J,jardins,,,395,3.67291,45.815529
2020-909279,2020-10-07,000001,Vente,60000,5223,,L OJARDIE,B146,63250,63463,Viscomtat,63,,,63463000AX0413,,,,,,,,,,,,,0,3,Dépendance,,0,S,sols,,,310,3.672729,45.815356
2020-909279,2020-10-07,000001,Vente,60000,5223,,L OJARDIE,B146,63250,63463,Viscomtat,63,,,63463000AX0413,,,,,,,,,,,,,0,3,Dépendance,,0,S,sols,,,310,3.672729,45.815356
2020-909279,2020-10-07,000001,Vente,60000,5223,,L OJARDIE,B146,63250,63463,Viscomtat,63,,,63463000AX0413,,,,,,,,,,,,,0,1,Maison,50,3,S,sols,,,310,3.672729,45.815356
2020-909279,2020-10-07,000001,Vente,60000,5223,,L OJARDIE,B146,63250,63463,Viscomtat,63,,,63463000AX0413,,,,,,,,,,,,,0,3,Dépendance,,0,S,sols,,,310,3.672729,45.815356
2020-909279,2020-10-07,000001,Vente,60000,,,L OJARDIE,B146,63250,63463,Viscomtat,63,,,63463000AX0414,,,,,,,,,,,,,0,,,,,L,landes,,,55,3.672597,45.815204
2020-909279,2020-10-07,000001,Vente,60000,,,L OJARDIE,B146,63250,63463,Viscomtat,63,,,63463000AX0415,,,,,,,,,,,,,0,,,,,P,prés,,,1070,3.672839,45.814954
2020-909279,2020-10-07,000001,Vente,60000,,,L OJARDIE,B146,63250,63463,Viscomtat,63,,,63463000AX0422,,,,,,,,,,,,,0,,,,,S,sols,,,94,3.672244,45.814878
2020-909279,2020-10-07,000001,Vente,60000,,,L OJARDIE,B146,63250,63463,Viscomtat,63,,,63463000AX0423,,,,,,,,,,,,,0,,,,,P,prés,,,873,3.672061,45.814754
2020-909505,2020-11-18,000001,Vente,98850,5006,,BOURDIER,B020,63250,63463,Viscomtat,63,,,63463000AL0080,,,,,,,,,,,,,0,2,Appartement,38,1,S,sols,,,1180,3.707573,45.841389
2020-909505,2020-11-18,000001,Vente,98850,5006,,BOURDIER,B020,63250,63463,Viscomtat,63,,,63463000AL0080,,,,,,,,,,,,,0,2,Appartement,73,5,S,sols,,,1180,3.707573,45.841389
2020-909505,2020-11-18,000001,Vente,98850,5006,,BOURDIER,B020,63250,63463,Viscomtat,63,,,63463000AL0080,,,,,,,,,,,,,0,3,Dépendance,,0,S,sols,,,1180,3.707573,45.841389
2020-909505,2020-11-18,000001,Vente,98850,,,BOURDIER,B020,63250,63463,Viscomtat,63,,,63463000AL0081,,,,,,,,,,,,,0,,,,,J,jardins,,,445,3.708032,45.841188
2020-909505,2020-11-18,000001,Vente,98850,,,SAGNE CHANY,B205,63250,63463,Viscomtat,63,,,63463000AM0109,,,,,,,,,,,,,0,,,,,T,terres,,,3680,3.707387,45.842091
2020-909505,2020-11-18,000001,Vente,98850,,,SAGNE CHANY,B205,63250,63463,Viscomtat,63,,,63463000AM0110,,,,,,,,,,,,,0,,,,,PA,pâtures,,,1930,3.708076,45.842432
2020-909505,2020-11-18,000001,Vente,98850,,,SAGNE CHANY,B205,63250,63463,Viscomtat,63,,,63463000AM0111,,,,,,,,,,,,,0,,,,,T,terres,,,3505,3.708781,45.842942
2020-909652,2020-11-16,000001,Vente,17325,,,BOULARD,B017,63250,63463,Viscomtat,63,,,63463000AE0170,,,,,,,,,,,,,0,,,,,BR,futaies résineuses,,,4800,3.692718,45.824617
2020-909652,2020-11-16,000001,Vente,17325,,,BOULARD,B017,63250,63463,Viscomtat,63,,,63463000AE0178,,,,,,,,,,,,,0,,,,,BR,futaies résineuses,,,3785,3.69072,45.825686
2020-909652,2020-11-16,000001,Vente,17325,,,BOULARD,B017,63250,63463,Viscomtat,63,,,63463000AE0182,,,,,,,,,,,,,0,,,,,BR,futaies résineuses,,,225,3.69147,45.828506
2020-909652,2020-11-16,000001,Vente,17325,,,CHARLIE,B034,63250,63463,Viscomtat,63,,,63463000AE0211,,,,,,,,,,,,,0,,,,,BR,futaies résineuses,,,4140,3.69032,45.82445
2020-909652,2020-11-16,000001,Vente,17325,,,BOULARD,B017,63250,63463,Viscomtat,63,,,63463000AE0451,,,,,,,,,,,,,0,,,,,BR,futaies résineuses,,,10522,3.690156,45.827318
2020-909652,2020-11-16,000001,Vente,17325,,,BOULARD,B017,63250,63463,Viscomtat,63,,,63463000AT0063,,,,,,,,,,,,,0,,,,,BR,futaies résineuses,,,11680,3.691803,45.822137
2020-909652,2020-11-16,000001,Vente,17325,,,BOULARD,B017,63250,63463,Viscomtat,63,,,63463000AT0066,,,,,,,,,,,,,0,,,,,BR,futaies résineuses,,,3010,3.691869,45.823245
2020-909751,2020-12-14,000001,Vente,15200,5074,,LES MURES,B144,63250,63463,Viscomtat,63,,,63463000AD0128,,,,,,,,,,,,,0,1,Maison,250,4,S,sols,,,1310,3.676836,45.832725
2020-909751,2020-12-14,000001,Vente,15200,,,LES MURS,B145,63250,63463,Viscomtat,63,,,63463000AD0129,,,,,,,,,,,,,0,,,,,J,jardins,,,640,3.677313,45.8328
2020-909751,2020-12-14,000001,Vente,15200,,,LES MURS,B145,63250,63463,Viscomtat,63,,,63463000AD0139,,,,,,,,,,,,,0,,,,,P,prés,,,3280,3.676156,45.83107
2020-909751,2020-12-14,000001,Vente,15200,,,LES MURS,B145,63250,63463,Viscomtat,63,,,63463000AD0141,,,,,,,,,,,,,0,,,,,P,prés,,,1400,3.676405,45.831844
2020-909751,2020-12-14,000001,Vente,15200,,,LES MURS,B145,63250,63463,Viscomtat,63,,,63463000AD0374,,,,,,,,,,,,,0,,,,,T,terres,,,3778,3.675978,45.833303
2020-909751,2020-12-14,000001,Vente,15200,,,LES MURS,B145,63250,63463,Viscomtat,63,,,63463000AD0376,,,,,,,,,,,,,0,,,,,T,terres,,,24080,3.676796,45.832913
2020-909780,2020-12-11,000001,Vente,1300,,,LE PRADET,B177,63250,63463,Viscomtat,63,,,63463000AE0277,,,,,,,,,,,,,0,,,,,PA,pâtures,,,7280,3.683081,45.830712
2020-909841,2020-12-14,000001,Vente,11400,5074,,LES MURES,B144,63250,63463,Viscomtat,63,,,63463000AD0128,,,,,,,,,,,,,0,1,Maison,250,4,S,sols,,,1310,3.676836,45.832725
2020-909841,2020-12-14,000001,Vente,11400,,,LES MURS,B145,63250,63463,Viscomtat,63,,,63463000AD0129,,,,,,,,,,,,,0,,,,,J,jardins,,,640,3.677313,45.8328
2020-909841,2020-12-14,000001,Vente,11400,,,LES MURS,B145,63250,63463,Viscomtat,63,,,63463000AD0139,,,,,,,,,,,,,0,,,,,P,prés,,,3280,3.676156,45.83107
2020-909841,2020-12-14,000001,Vente,11400,,,LES MURS,B145,63250,63463,Viscomtat,63,,,63463000AD0141,,,,,,,,,,,,,0,,,,,P,prés,,,1400,3.676405,45.831844
2020-909841,2020-12-14,000001,Vente,11400,,,LES MURS,B145,63250,63463,Viscomtat,63,,,63463000AD0374,,,,,,,,,,,,,0,,,,,T,terres,,,3778,3.675978,45.833303
2020-909841,2020-12-14,000001,Vente,11400,,,LES MURS,B145,63250,63463,Viscomtat,63,,,63463000AD0376,,,,,,,,,,,,,0,,,,,T,terres,,,24080,3.676796,45.832913
2020-909859,2020-11-20,000001,Vente,120000,5029,,MOULIN DE LA COURTADE,B140,63250,63463,Viscomtat,63,,,63463000AE0010,,,,,,,,,,,,,0,3,Dépendance,,0,S,sols,,,114,3.68373,45.838656
2020-909859,2020-11-20,000001,Vente,120000,5032,,MOULIN DE LA COURTADE,B140,63250,63463,Viscomtat,63,,,63463000AE0348,,,,,,,,,,,,,0,1,Maison,32,3,S,sols,,,35,3.683428,45.838825
2020-909859,2020-11-20,000001,Vente,120000,5034,,MOULIN DE LA COURTADE,B140,63250,63463,Viscomtat,63,,,63463000AE0349,,,,,,,,,,,,,0,1,Maison,30,1,S,sols,,,30,3.683463,45.83879
2020-909859,2020-11-20,000001,Vente,120000,,,MOULIN DE LA COURTADE,B140,63250,63463,Viscomtat,63,,,63463000AE0408,,,,,,,,,,,,,0,,,,,S,sols,,,23,3.683433,45.838629
2020-909859,2020-11-20,000001,Vente,120000,5030,,MOULIN DE LA COURTADE,B140,63250,63463,Viscomtat,63,,,63463000AE0411,,,,,,,,,,,,,0,1,Maison,100,4,S,sols,,,274,3.683464,45.83871
2020-909859,2020-11-20,000001,Vente,120000,,,MOULIN DE LA COURTADE,B140,63250,63463,Viscomtat,63,,,63463000AE0413,,,,,,,,,,,,,0,,,,,S,sols,,,28,3.68332,45.838778
2020-909859,2020-11-20,000001,Vente,120000,,,MOULIN DE LA COURTADE,B140,63250,63463,Viscomtat,63,,,63463000AE0414,,,,,,,,,,,,,0,,,,,P,prés,,,140,3.683338,45.838683
2020-909859,2020-11-20,000001,Vente,120000,,,MOULIN DE LA COURTADE,B140,63250,63463,Viscomtat,63,,,63463000AE0446,,,,,,,,,,,,,0,,,,,P,prés,,,296,3.684046,45.838534
2020-909890,2020-12-19,000001,Vente,39000,5304,,VISCOMTAT,B226,63250,63463,Viscomtat,63,,,63463000AB0104,,,,,,,,,,,,,0,1,Maison,104,6,S,sols,,,305,3.67558,45.828107
2020-909890,2020-12-19,000001,Vente,39000,5304,,VISCOMTAT,B226,63250,63463,Viscomtat,63,,,63463000AB0104,,,,,,,,,,,,,0,4,Local industriel. commercial ou assimilé,42,0,S,sols,,,305,3.67558,45.828107
2020-909890,2020-12-19,000001,Vente,39000,5305,,VISCOMTAT,B226,63250,63463,Viscomtat,63,,,63463000AB0105,,,,,,,,,,,,,0,3,Dépendance,,0,S,sols,,,125,3.675749,45.828182
2020-909890,2020-12-19,000001,Vente,39000,5305,,VISCOMTAT,B226,63250,63463,Viscomtat,63,,,63463000AB0105,,,,,,,,,,,,,0,1,Maison,56,3,S,sols,,,125,3.675749,45.828182
2020-909890,2020-12-19,000001,Vente,39000,,,VISCOMTAT,B226,63250,63463,Viscomtat,63,,,63463000AB0146,,,,,,,,,,,,,0,,,,,S,sols,,,65,3.67589,45.8281
