id_mutation,date_mutation,numero_disposition,nature_mutation,valeur_fonciere,adresse_numero,adresse_suffixe,adresse_nom_voie,adresse_code_voie,code_postal,code_commune,nom_commune,code_departement,ancien_code_commune,ancien_nom_commune,id_parcelle,ancien_id_parcelle,numero_volume,lot1_numero,lot1_surface_carrez,lot2_numero,lot2_surface_carrez,lot3_numero,lot3_surface_carrez,lot4_numero,lot4_surface_carrez,lot5_numero,lot5_surface_carrez,nombre_lots,code_type_local,type_local,surface_reelle_bati,nombre_pieces_principales,code_nature_culture,nature_culture,code_nature_culture_speciale,nature_culture_speciale,surface_terrain,longitude,latitude
2020-914525,2020-06-25,000001,Vente,3000,,,DEUS ESQUIOTS,B052,64360,64442,Parbayse,64,,,644420000C0424,,,,,,,,,,,,,0,,,,,T,terres,,,2215,-0.541339,43.31939
2020-914790,2020-07-03,000001,Vente,55006.84,10,,CHE DEUS ESQUIOTS,0030,64360,64442,Parbayse,64,,,644420000C0489,,,,,,,,,,,,,0,1,Maison,100,4,S,sols,,,1000,-0.541487,43.325144
2020-914790,2020-07-03,000001,Vente,55006.84,10,,CHE DEUS ESQUIOTS,0030,64360,64442,Parbayse,64,,,644420000C0489,,,,,,,,,,,,,0,1,Maison,100,4,J,jardins,,,800,-0.541487,43.325144
2020-915147,2020-07-17,000001,Vente,218100,18,,RTE DE MONEIN,0055,64360,64442,Parbayse,64,,,644420000B0600,,,,,,,,,,,,,0,1,Maison,146,4,J,jardins,,,2027,-0.547905,43.322677
2020-915147,2020-07-17,000001,Vente,218100,18,,RTE DE MONEIN,0055,64360,64442,Parbayse,64,,,644420000B0600,,,,,,,,,,,,,0,1,Maison,146,4,S,sols,,,1000,-0.547905,43.322677
2020-915147,2020-07-17,000001,Vente,218100,,,LA COSTE NABE,B041,64360,64442,Parbayse,64,,,644420000B0601,,,,,,,,,,,,,0,,,,,T,terres,,,3019,-0.54764,43.322862
2020-915147,2020-07-17,000001,Vente,218100,,,LA COSTE NABE,B041,64360,64442,Parbayse,64,,,644420000B0602,,,,,,,,,,,,,0,,,,,L,landes,VAGUE,Terrain vague,100,-0.547487,43.322431
2020-915775,2020-08-05,000001,Vente,258400,28,,CHE DEUS ESQUIOTS,0030,64360,64442,Parbayse,64,,,644420000C0513,,,,,,,,,,,,,0,1,Maison,145,4,S,sols,,,1000,-0.539511,43.323857
2020-915775,2020-08-05,000001,Vente,258400,28,,CHE DEUS ESQUIOTS,0030,64360,64442,Parbayse,64,,,644420000C0513,,,,,,,,,,,,,0,1,Maison,145,4,J,jardins,,,1030,-0.539511,43.323857
2020-916931,2020-10-12,000001,Vente,216000,10,,CHE DEUS ESQUIOTS,0030,64360,64442,Parbayse,64,,,644420000C0489,,,,,,,,,,,,,0,1,Maison,100,4,S,sols,,,1000,-0.541487,43.325144
2020-916931,2020-10-12,000001,Vente,216000,10,,CHE DEUS ESQUIOTS,0030,64360,64442,Parbayse,64,,,644420000C0489,,,,,,,,,,,,,0,1,Maison,100,4,J,jardins,,,800,-0.541487,43.325144
2020-916982,2020-09-25,000001,Vente,138000,,,CAMPAINOT,B028,64360,64442,Parbayse,64,,,644420000B0183,,,,,,,,,,,,,0,,,,,S,sols,,,380,-0.55129,43.328983
2020-916982,2020-09-25,000001,Vente,138000,8,,CHE DES VIGNES,0090,64360,64442,Parbayse,64,,,644420000B0184,,,,,,,,,,,,,0,1,Maison,85,4,S,sols,,,600,-0.551394,43.328953
2020-916982,2020-09-25,000001,Vente,138000,,,CAMPAINOT,B028,64360,64442,Parbayse,64,,,644420000B0520,,,,,,,,,,,,,0,,,,,P,prés,,,239,-0.551805,43.328881
2020-916982,2020-09-25,000001,Vente,138000,,,CAMPAINOT,B028,64360,64442,Parbayse,64,,,644420000B0522,,,,,,,,,,,,,0,,,,,P,prés,,,1278,-0.551631,43.329141
2020-919528,2020-12-29,000001,Vente,105000,5017,,RTE DE MONEIN,0055,64360,64442,Parbayse,64,,,644420000C0241,,,,,,,,,,,,,0,1,Maison,158,3,S,sols,,,545,-0.54607,43.323506
2020-919528,2020-12-29,000001,Vente,105000,,,DEUS ESQUIOTS,B052,64360,64442,Parbayse,64,,,644420000C0242,,,,,,,,,,,,,0,,,,,J,jardins,,,430,-0.546363,43.323289
2020-919528,2020-12-29,000001,Vente,105000,,,DEUS ESQUIOTS,B052,64360,64442,Parbayse,64,,,644420000C0243,,,,,,,,,,,,,0,,,,,P,prés,,,480,-0.546651,43.322812
2020-919528,2020-12-29,000001,Vente,105000,,,DEUS ESQUIOTS,B052,64360,64442,Parbayse,64,,,644420000C0244,,,,,,,,,,,,,0,,,,,T,terres,,,5230,-0.546172,43.322722
2020-919528,2020-12-29,000001,Vente,105000,,,DEUS ESQUIOTS,B052,64360,64442,Parbayse,64,,,644420000C0531,,,,,,,,,,,,,0,,,,,S,sols,,,206,-0.54587,43.323664
2020-919528,2020-12-29,000001,Vente,105000,,,DEUS ESQUIOTS,B052,64360,64442,Parbayse,64,,,644420000C0533,,,,,,,,,,,,,0,,,,,T,terres,,,3033,-0.545831,43.323219
2020-919528,2020-12-29,000001,Vente,105000,,,DEUS ESQUIOTS,B052,64360,64442,Parbayse,64,,,644420000C0533,,,,,,,,,,,,,0,,,,,S,sols,,,170,-0.545831,43.323219
2020-919528,2020-12-29,000001,Vente,105000,,,DEUS ESQUIOTS,B052,64360,64442,Parbayse,64,,,644420000C0535,,,,,,,,,,,,,0,,,,,T,terres,,,1478,-0.54549,43.323221
2020-919528,2020-12-29,000001,Vente,105000,,,DEUS ESQUIOTS,B052,64360,64442,Parbayse,64,,,644420000C0536,,,,,,,,,,,,,0,,,,,T,terres,,,1196,-0.545616,43.322923
