id_mutation,date_mutation,numero_disposition,nature_mutation,valeur_fonciere,adresse_numero,adresse_suffixe,adresse_nom_voie,adresse_code_voie,code_postal,code_commune,nom_commune,code_departement,ancien_code_commune,ancien_nom_commune,id_parcelle,ancien_id_parcelle,numero_volume,lot1_numero,lot1_surface_carrez,lot2_numero,lot2_surface_carrez,lot3_numero,lot3_surface_carrez,lot4_numero,lot4_surface_carrez,lot5_numero,lot5_surface_carrez,nombre_lots,code_type_local,type_local,surface_reelle_bati,nombre_pieces_principales,code_nature_culture,nature_culture,code_nature_culture_speciale,nature_culture_speciale,surface_terrain,longitude,latitude
2020-912213,2020-01-30,000001,Vente,24000,,,JOUARECHOU,B052,64410,64457,Poursiugues-Boucoue,64,,,644570000D0007,,,,,,,,,,,,,0,,,,,T,terres,,,20000,-0.398037,43.554438
2020-912270,2020-02-06,000001,Vente,152000,,,BARRAQUE,B003,64410,64457,Poursiugues-Boucoue,64,,,644570000A0076,,,,,,,,,,,,,0,,,,,BS,taillis sous futaie,,,2365,-0.357865,43.559568
2020-912270,2020-02-06,000001,Vente,152000,,,BARRAQUE,B003,64410,64457,Poursiugues-Boucoue,64,,,644570000A0077,,,,,,,,,,,,,0,,,,,T,terres,,,12200,-0.357858,43.558406
2020-912270,2020-02-06,000001,Vente,152000,5030,,BARRAQUE,B003,64410,64457,Poursiugues-Boucoue,64,,,644570000A0078,,,,,,,,,,,,,0,2,Appartement,70,2,S,sols,,,1299,-0.358452,43.558151
2020-912270,2020-02-06,000001,Vente,152000,5030,,BARRAQUE,B003,64410,64457,Poursiugues-Boucoue,64,,,644570000A0078,,,,,,,,,,,,,0,2,Appartement,70,2,S,sols,,,1299,-0.358452,43.558151
2020-912270,2020-02-06,000001,Vente,152000,5030,,BARRAQUE,B003,64410,64457,Poursiugues-Boucoue,64,,,644570000A0078,,,,,,,,,,,,,0,1,Maison,176,6,S,sols,,,1299,-0.358452,43.558151
2020-912270,2020-02-06,000001,Vente,152000,,,BARRAQUE,B003,64410,64457,Poursiugues-Boucoue,64,,,644570000A0079,,,,,,,,,,,,,0,,,,,J,jardins,,,1050,-0.358088,43.557696
2020-912270,2020-02-06,000001,Vente,152000,,,BARRAQUE,B003,64410,64457,Poursiugues-Boucoue,64,,,644570000A0272,,,,,,,,,,,,,0,,,,,T,terres,,,685,-0.35857,43.558299
2020-912270,2020-02-06,000001,Vente,152000,,,BARRAQUE,B003,64410,64457,Poursiugues-Boucoue,64,,,644570000A0324,,,,,,,,,,,,,0,,,,,S,sols,,,69,-0.35826,43.557899
2020-913042,2020-02-29,000001,Vente,2000,,,HILLAN,B049,64410,64457,Poursiugues-Boucoue,64,,,644570000B0014,,,,,,,,,,,,,0,,,,,L,landes,,,2610,-0.380592,43.555624
2020-913042,2020-02-29,000001,Vente,2000,,,HILLAN,B049,64410,64457,Poursiugues-Boucoue,64,,,644570000B0015,,,,,,,,,,,,,0,,,,,L,landes,VAGUE,Terrain vague,17450,-0.379695,43.55501
2020-916732,2020-10-13,000001,Vente,125000,,,CAPDEROT,B017,64410,64457,Poursiugues-Boucoue,64,,,644570000B0225,,,,,,,,,,,,,0,,,,,J,jardins,,,705,-0.36651,43.551121
2020-916732,2020-10-13,000001,Vente,125000,5023,,CAPDEROT,B017,64410,64457,Poursiugues-Boucoue,64,,,644570000B0227,,,,,,,,,,,,,0,1,Maison,244,4,S,sols,,,1243,-0.366724,43.551011
2020-916732,2020-10-13,000001,Vente,125000,,,CAPDEROT,B017,64410,64457,Poursiugues-Boucoue,64,,,644570000B0228,,,,,,,,,,,,,0,,,,,P,prés,,,6250,-0.367048,43.550845
2020-916732,2020-10-13,000001,Vente,125000,,,CAPDEROT,B017,64410,64457,Poursiugues-Boucoue,64,,,644570000B0488,,,,,,,,,,,,,0,,,,,T,terres,,,204,-0.36636,43.551182
2020-916732,2020-10-13,000001,Vente,125000,,,CAPDEROT,B017,64410,64457,Poursiugues-Boucoue,64,,,644570000B0490,,,,,,,,,,,,,0,,,,,P,prés,,,1476,-0.366136,43.550888
2020-916732,2020-10-13,000001,Vente,125000,,,CAPDEROT,B017,64410,64457,Poursiugues-Boucoue,64,,,644570000B0491,,,,,,,,,,,,,0,,,,,S,sols,,,602,-0.367105,43.551152
2020-916732,2020-10-13,000001,Vente,125000,,,CAPDEROT,B017,64410,64457,Poursiugues-Boucoue,64,,,644570000B0491,,,,,,,,,,,,,0,,,,,T,terres,,,2436,-0.367105,43.551152
2020-919163,2020-12-18,000001,Vente,80000,,,SESQUES,B088,64410,64457,Poursiugues-Boucoue,64,,,644570000D0163,,,,,,,,,,,,,0,,,,,P,prés,,,2055,-0.383355,43.56562
2020-919163,2020-12-18,000001,Vente,80000,,,SESQUES,B088,64410,64457,Poursiugues-Boucoue,64,,,644570000D0164,,,,,,,,,,,,,0,,,,,S,sols,,,155,-0.383253,43.565475
2020-919163,2020-12-18,000001,Vente,80000,5049,,SESQUES,B088,64410,64457,Poursiugues-Boucoue,64,,,644570000D0165,,,,,,,,,,,,,0,1,Maison,86,3,S,sols,,,580,-0.383228,43.565411
2020-919163,2020-12-18,000001,Vente,80000,5049,,SESQUES,B088,64410,64457,Poursiugues-Boucoue,64,,,644570000D0165,,,,,,,,,,,,,0,3,Dépendance,,0,S,sols,,,580,-0.383228,43.565411
2020-919163,2020-12-18,000001,Vente,80000,,,SESQUES,B088,64410,64457,Poursiugues-Boucoue,64,,,644570000D0166,,,,,,,,,,,,,0,,,,,J,jardins,,,745,-0.38341,43.565373
2020-919163,2020-12-18,000001,Vente,80000,,,SESQUES,B088,64410,64457,Poursiugues-Boucoue,64,,,644570000D0189,,,,,,,,,,,,,0,,,,,T,terres,,,1470,-0.384544,43.564496
2020-919163,2020-12-18,000001,Vente,80000,,,SESQUES,B088,64410,64457,Poursiugues-Boucoue,64,,,644570000D0190,,,,,,,,,,,,,0,,,,,T,terres,,,9520,-0.383679,43.564858
