id_mutation,date_mutation,numero_disposition,nature_mutation,valeur_fonciere,adresse_numero,adresse_suffixe,adresse_nom_voie,adresse_code_voie,code_postal,code_commune,nom_commune,code_departement,ancien_code_commune,ancien_nom_commune,id_parcelle,ancien_id_parcelle,numero_volume,lot1_numero,lot1_surface_carrez,lot2_numero,lot2_surface_carrez,lot3_numero,lot3_surface_carrez,lot4_numero,lot4_surface_carrez,lot5_numero,lot5_surface_carrez,nombre_lots,code_type_local,type_local,surface_reelle_bati,nombre_pieces_principales,code_nature_culture,nature_culture,code_nature_culture_speciale,nature_culture_speciale,surface_terrain,longitude,latitude
2020-914837,2020-07-07,000001,Vente,38000,,,COMMERES,B023,64330,64534,Taron-Sadirac-Viellenave,64,,,64534000AL0001,,,,,,,,,,,,,0,,,,,L,landes,VAGUE,Terrain vague,2790,-0.245362,43.499074
2020-914837,2020-07-07,000001,Vente,38000,,,COMMERES,B023,64330,64534,Taron-Sadirac-Viellenave,64,,,64534000AL0002,,,,,,,,,,,,,0,,,,,T,terres,,,17010,-0.244835,43.499219
2020-914837,2020-07-07,000001,Vente,38000,,,COMMERES,B023,64330,64534,Taron-Sadirac-Viellenave,64,,,64534000AL0002,,,,,,,,,,,,,0,,,,,BT,taillis simples,,,2640,-0.244835,43.499219
2020-914837,2020-07-07,000001,Vente,38000,,,COMMERES,B023,64330,64534,Taron-Sadirac-Viellenave,64,,,64534000AL0023,,,,,,,,,,,,,0,,,,,T,terres,,,2290,-0.244144,43.499235
2020-916507,2020-10-01,000001,Vente,972325,,,SADIRACQ,B085,64330,64534,Taron-Sadirac-Viellenave,64,,,64534000AE0094,,,,,,,,,,,,,0,,,,,S,sols,,,50,-0.232864,43.522558
2020-916507,2020-10-01,000001,Vente,972325,,,SADIRACQ,B085,64330,64534,Taron-Sadirac-Viellenave,64,,,64534000AE0095,,,,,,,,,,,,,0,,,,,BT,taillis simples,,,1630,-0.232997,43.522028
2020-916507,2020-10-01,000001,Vente,972325,,,SADIRACQ,B085,64330,64534,Taron-Sadirac-Viellenave,64,,,64534000AE0096,,,,,,,,,,,,,0,,,,,J,jardins,,,1825,-0.232641,43.521636
2020-916507,2020-10-01,000001,Vente,972325,1100,,RTE DU MOUTTA,0190,64330,64534,Taron-Sadirac-Viellenave,64,,,64534000AE0097,,,,,,,,,,,,,0,1,Maison,220,4,S,sols,,,1995,-0.232941,43.521467
2020-916507,2020-10-01,000001,Vente,972325,,,SADIRACQ,B085,64330,64534,Taron-Sadirac-Viellenave,64,,,64534000AE0098,,,,,,,,,,,,,0,,,,,P,prés,,,6480,-0.233194,43.521265
2020-916507,2020-10-01,000001,Vente,972325,,,SADIRACQ,B085,64330,64534,Taron-Sadirac-Viellenave,64,,,64534000AE0098,,,,,,,,,,,,,0,,,,,S,sols,,,1165,-0.233194,43.521265
2020-916507,2020-10-01,000001,Vente,972325,,,SADIRACQ,B085,64330,64534,Taron-Sadirac-Viellenave,64,,,64534000AE0107,,,,,,,,,,,,,0,,,,,P,prés,,,1607,-0.232799,43.522395
2020-916507,2020-10-01,000001,Vente,972325,,,SADIRACQ,B085,64330,64534,Taron-Sadirac-Viellenave,64,,,64534000AE0109,,,,,,,,,,,,,0,,,,,T,terres,,,156,-0.232579,43.521125
