id_mutation,date_mutation,numero_disposition,nature_mutation,valeur_fonciere,adresse_numero,adresse_suffixe,adresse_nom_voie,adresse_code_voie,code_postal,code_commune,nom_commune,code_departement,ancien_code_commune,ancien_nom_commune,id_parcelle,ancien_id_parcelle,numero_volume,lot1_numero,lot1_surface_carrez,lot2_numero,lot2_surface_carrez,lot3_numero,lot3_surface_carrez,lot4_numero,lot4_surface_carrez,lot5_numero,lot5_surface_carrez,nombre_lots,code_type_local,type_local,surface_reelle_bati,nombre_pieces_principales,code_nature_culture,nature_culture,code_nature_culture_speciale,nature_culture_speciale,surface_terrain,longitude,latitude
2020-931556,2020-06-22,000001,Vente,15000,,,LE BOURG,B010,65100,65334,Omex,65,,,653340000C0163,,,,,,,,,,,,,0,,,,,S,sols,,,411,-0.081518,43.076326
2020-931963,2020-07-27,000001,Vente,11000,,,CAMPEILLOU,B011,65100,65334,Omex,65,,,653340000D0011,,,,,,,,,,,,,0,,,,,L,landes,PATUR,Pâture plantée,5465,-0.097199,43.071784
2020-932520,2020-08-24,000001,Vente,100000,,,EXG,B014,65100,65334,Omex,65,,,653340000C0026,,,,,,,,,,,,,0,,,,,P,prés,,,6707,-0.093191,43.081564
2020-932520,2020-08-24,000001,Vente,100000,18,,CAMI D ECH,0050,65100,65334,Omex,65,,,653340000C0027,,,,,,,,,,,,,0,1,Maison,78,2,S,sols,,,102,-0.09301,43.081688
2020-932520,2020-08-24,000001,Vente,100000,,,EXG,B014,65100,65334,Omex,65,,,653340000C0033,,,,,,,,,,,,,0,,,,,BF,futaies feuillues,HETRE,Hêtres,1006,-0.092941,43.08139
2020-932520,2020-08-24,000001,Vente,100000,,,EXG,B014,65100,65334,Omex,65,,,653340000C0355,,,,,,,,,,,,,0,,,,,L,landes,FRICH,Friche,934,-0.093705,43.081996
2020-934438,2020-11-16,000001,Vente,242700,8,,CHE DE L EGLISE,0120,65100,65334,Omex,65,,,653340000C0161,,,,,,,,,,,,,0,1,Maison,100,4,S,sols,,,1730,-0.080989,43.076412
2020-934785,2020-12-08,000001,Vente,173350,5000,,CAMI DE LANES,0070,65100,65334,Omex,65,,,653340000C0137,,,,,,,,,,,,,0,1,Maison,102,4,T,terres,,,165,-0.079526,43.07688
2020-934785,2020-12-08,000001,Vente,173350,5000,,CAMI DE LANES,0070,65100,65334,Omex,65,,,653340000C0137,,,,,,,,,,,,,0,1,Maison,102,4,S,sols,,,1000,-0.079526,43.07688
2020-934785,2020-12-08,000001,Vente,173350,,,LANES,B018,65100,65334,Omex,65,,,653340000C0433,,,,,,,,,,,,,0,,,,,T,terres,,,230,-0.078946,43.076289
