id_mutation,date_mutation,numero_disposition,nature_mutation,valeur_fonciere,adresse_numero,adresse_suffixe,adresse_nom_voie,adresse_code_voie,code_postal,code_commune,nom_commune,code_departement,ancien_code_commune,ancien_nom_commune,id_parcelle,ancien_id_parcelle,numero_volume,lot1_numero,lot1_surface_carrez,lot2_numero,lot2_surface_carrez,lot3_numero,lot3_surface_carrez,lot4_numero,lot4_surface_carrez,lot5_numero,lot5_surface_carrez,nombre_lots,code_type_local,type_local,surface_reelle_bati,nombre_pieces_principales,code_nature_culture,nature_culture,code_nature_culture_speciale,nature_culture_speciale,surface_terrain,longitude,latitude
2020-929496,2020-01-10,000001,Vente,23000,,,LE BOURG,B009,65100,65351,Ousté,65,,,653510000B0151,,,,,,,,,,,,,0,,,,,S,sols,,,297,-0.012551,43.049845
2020-929717,2020-01-28,000001,Vente,20000,,,CARRERE,B011,65100,65351,Ousté,65,,,653510000B0125,,,,,,,,,,,,,0,,,,,S,sols,,,643,-0.012155,43.051106
2020-929717,2020-01-28,000001,Vente,20000,,,CARRERE,B011,65100,65351,Ousté,65,,,653510000B0126,,,,,,,,,,,,,0,,,,,P,prés,,,3996,-0.011342,43.051046
2020-929717,2020-01-28,000001,Vente,20000,,,CARRERE,B011,65100,65351,Ousté,65,,,653510000B0127,,,,,,,,,,,,,0,,,,,P,prés,,,5807,-0.010615,43.051304
2020-930596,2020-04-23,000001,Vente,168620,5001,,DEPRADA,B019,65100,65351,Ousté,65,,,653510000A0028,,,,,,,,,,,,,0,1,Maison,88,2,S,sols,,,192,-0.020878,43.051494
2020-930596,2020-04-23,000001,Vente,168620,,,DEPRADA,B019,65100,65351,Ousté,65,,,653510000A0030,,,,,,,,,,,,,0,,,,,P,prés,,,3227,-0.021532,43.050755
2020-930596,2020-04-23,000001,Vente,168620,,,DEPRADA,B019,65100,65351,Ousté,65,,,653510000A0031,,,,,,,,,,,,,0,,,,,BT,taillis simples,,,620,-0.02123,43.050272
2020-930596,2020-04-23,000001,Vente,168620,,,DEPRADA,B019,65100,65351,Ousté,65,,,653510000A0075,,,,,,,,,,,,,0,,,,,BT,taillis simples,,,1969,-0.021235,43.051228
2020-930596,2020-04-23,000001,Vente,168620,,,DEPRADA,B019,65100,65351,Ousté,65,,,653510000A0077,,,,,,,,,,,,,0,,,,,T,terres,,,8709,-0.020907,43.050345
2020-930596,2020-04-23,000001,Vente,168620,,,ALLY,B002,65100,65351,Ousté,65,,,653510000A0080,,,,,,,,,,,,,0,,,,,BT,taillis simples,,,28,-0.020984,43.051584
2020-930596,2020-04-23,000001,Vente,168620,,,ALLY,B002,65100,65351,Ousté,65,,,653510000A0082,,,,,,,,,,,,,0,,,,,L,landes,PATUR,Pâture plantée,120,-0.020865,43.051632
2020-930596,2020-04-23,000001,Vente,168620,,,DEPRADA,B019,65100,65351,Ousté,65,,,653510000A0084,,,,,,,,,,,,,0,,,,,T,terres,,,360,-0.020776,43.051517
2020-931286,2020-06-16,000001,Vente,65000,6,,RUE DE L'EGLISE,0030,65100,65351,Ousté,65,,,653510000B0266,,,,,,,,,,,,,0,1,Maison,48,3,S,sols,,,513,-0.013372,43.049745
2020-934495,2020-12-07,000001,Vente,290000,3,,CHE DE COUDET,0020,65100,65351,Ousté,65,,,653510000B0161,,,,,,,,,,,,,0,3,Dépendance,,0,S,sols,,,1350,-0.013897,43.04938
2020-934495,2020-12-07,000001,Vente,290000,3,,CHE DE COUDET,0020,65100,65351,Ousté,65,,,653510000B0161,,,,,,,,,,,,,0,1,Maison,150,3,S,sols,,,1350,-0.013897,43.04938
2020-934495,2020-12-07,000001,Vente,290000,,,LE BOURG,B009,65100,65351,Ousté,65,,,653510000B0162,,,,,,,,,,,,,0,,,,,P,prés,,,4355,-0.01408,43.048736
2020-934495,2020-12-07,000001,Vente,290000,,,LAHOUNT,B024,65100,65351,Ousté,65,,,653510000B0215,,,,,,,,,,,,,0,,,,,P,prés,,,3159,-0.014442,43.04749
2020-934495,2020-12-07,000001,Vente,290000,,,POUM EZ ANCLE,B029,65100,65351,Ousté,65,,,653510000B0270,,,,,,,,,,,,,0,,,,,L,landes,PATUR,Pâture plantée,5183,-0.014255,43.04982
2020-934495,2020-12-07,000001,Vente,290000,,,LAHOUNT,B024,65100,65351,Ousté,65,,,653510000B0292,,,,,,,,,,,,,0,,,,,T,terres,,,8852,-0.013993,43.047472
2020-934495,2020-12-07,000001,Vente,290000,,,LAHOUNT,B024,65100,65351,Ousté,65,,,653510000B0401,,,,,,,,,,,,,0,,,,,P,prés,,,5386,-0.014376,43.046601
2020-934495,2020-12-07,000001,Vente,290000,,,LAHOUNT,B024,65100,65351,Ousté,65,,,653510000B0404,,,,,,,,,,,,,0,,,,,P,prés,,,379,-0.014845,43.046672
2020-934495,2020-12-07,000001,Vente,290000,,,LAHOUNT,B024,65100,65351,Ousté,65,,,653510000B0405,,,,,,,,,,,,,0,,,,,P,prés,,,107,-0.014488,43.046813
2020-934495,2020-12-07,000001,Vente,290000,,,LAHOUNT,B024,65100,65351,Ousté,65,,,653510000B0407,,,,,,,,,,,,,0,,,,,P,prés,,,209,-0.014817,43.046635
2020-934495,2020-12-07,000001,Vente,290000,,,LAHOUNT,B024,65100,65351,Ousté,65,,,653510000B0409,,,,,,,,,,,,,0,,,,,T,terres,,,229,-0.013686,43.047118
2020-934495,2020-12-07,000001,Vente,290000,,,LAHOUNT,B024,65100,65351,Ousté,65,,,653510000B0410,,,,,,,,,,,,,0,,,,,T,terres,,,11,-0.013102,43.047275
2020-934495,2020-12-07,000001,Vente,290000,,,HERRERES,B021,65100,65351,Ousté,65,,,653510000C0079,,,,,,,,,,,,,0,,,,,P,prés,,,2178,-0.002094,43.04189
2020-934495,2020-12-07,000001,Vente,290000,,,HERRERES,B021,65100,65351,Ousté,65,,,653510000C0080,,,,,,,,,,,,,0,,,,,L,landes,ROC,Rocs ou rochers,3298,-0.001652,43.041938
2020-934495,2020-12-07,000001,Vente,290000,,,HERRERES,B021,65100,65351,Ousté,65,,,653510000C0081,,,,,,,,,,,,,0,,,,,BT,taillis simples,,,9233,-0.001272,43.041115
2020-934495,2020-12-07,000001,Vente,290000,,,HERRERES,B021,65100,65351,Ousté,65,,,653510000C0082,,,,,,,,,,,,,0,,,,,L,landes,ROC,Rocs ou rochers,2118,-0.000781,43.040229
2020-934495,2020-12-07,000001,Vente,290000,,,HERRERES,B021,65100,65351,Ousté,65,,,653510000C0083,,,,,,,,,,,,,0,,,,,P,prés,,,3837,-0.001207,43.040228
2020-934495,2020-12-07,000001,Vente,290000,,,HERRERES,B021,65100,65351,Ousté,65,,,653510000C0084,,,,,,,,,,,,,0,,,,,S,sols,,,351,-0.00109,43.039696
2020-934495,2020-12-07,000001,Vente,290000,,,HERRERES,B021,65100,65351,Ousté,65,,,653510000C0085,,,,,,,,,,,,,0,,,,,BT,taillis simples,,,24762,-0.001322,43.039258
2020-934495,2020-12-07,000001,Vente,290000,,,HERRERES,B021,65100,65351,Ousté,65,,,653510000C0086,,,,,,,,,,,,,0,,,,,P,prés,,,2230,-0.001468,43.040315
2020-934495,2020-12-07,000001,Vente,290000,,,HOURCADE,B022,65100,65351,Ousté,65,,,653510000C0115,,,,,,,,,,,,,0,,,,,L,landes,PATUR,Pâture plantée,25633,-0.009511,43.045286
2020-934495,2020-12-07,000001,Vente,290000,,,HOURCADE,B022,65100,65351,Ousté,65,,,653510000C0116,,,,,,,,,,,,,0,,,,,S,sols,,,308,-0.009892,43.045617
