id_mutation,date_mutation,numero_disposition,nature_mutation,valeur_fonciere,adresse_numero,adresse_suffixe,adresse_nom_voie,adresse_code_voie,code_postal,code_commune,nom_commune,code_departement,ancien_code_commune,ancien_nom_commune,id_parcelle,ancien_id_parcelle,numero_volume,lot1_numero,lot1_surface_carrez,lot2_numero,lot2_surface_carrez,lot3_numero,lot3_surface_carrez,lot4_numero,lot4_surface_carrez,lot5_numero,lot5_surface_carrez,nombre_lots,code_type_local,type_local,surface_reelle_bati,nombre_pieces_principales,code_nature_culture,nature_culture,code_nature_culture_speciale,nature_culture_speciale,surface_terrain,longitude,latitude
2020-945598,2020-01-06,000001,Vente,250000,26,,CHE D ESTAGEL,0090,66600,66069,Espira-de-l'Agly,66,,,66069000AH0500,,,,,,,,,,,,,0,1,Maison,105,3,S,sols,,,689,2.838072,42.774779
2020-945648,2020-01-08,000001,Vente,59900,,,L'ULLA DE LA MOLA,B080,66600,66069,Espira-de-l'Agly,66,,,66069000AD0190,,,,,,,,,,,,,0,,,,,AB,terrains a bâtir,,,210,2.826993,42.778497
2020-945658,2020-01-13,000001,Vente,34800,,,LAS PARETS D EN FELIP,B031,66600,66069,Espira-de-l'Agly,66,,,660690000C0526,,,,,,,,,,,,,0,,,,,T,terres,,,1130,2.827225,42.78633
2020-945658,2020-01-13,000001,Vente,34800,,,LAS PARETS D EN FELIP,B031,66600,66069,Espira-de-l'Agly,66,,,660690000C0527,,,,,,,,,,,,,0,,,,,T,terres,,,1180,2.827151,42.786017
2020-945658,2020-01-13,000001,Vente,34800,,,LAS PARETS D EN FELIP,B031,66600,66069,Espira-de-l'Agly,66,,,660690000C0537,,,,,,,,,,,,,0,,,,,L,landes,,,2870,2.825829,42.785575
2020-945658,2020-01-13,000001,Vente,34800,,,LAS PARETS D EN FELIP,B031,66600,66069,Espira-de-l'Agly,66,,,660690000C0538,,,,,,,,,,,,,0,,,,,T,terres,,,2340,2.826401,42.785199
2020-945701,2020-01-20,000001,Vente,25000,,,LE ROBOUL,B070,66600,66069,Espira-de-l'Agly,66,,,660690000B0294,,,,,,,,,,,,,0,,,,,VI,vignes,,,1840,2.852071,42.802066
2020-945701,2020-01-20,000001,Vente,25000,,,LE ROBOUL,B070,66600,66069,Espira-de-l'Agly,66,,,660690000B0295,,,,,,,,,,,,,0,,,,,T,terres,,,930,2.851579,42.801762
2020-945701,2020-01-20,000001,Vente,25000,,,LE ROBOUL,B070,66600,66069,Espira-de-l'Agly,66,,,660690000B0298,,,,,,,,,,,,,0,,,,,T,terres,,,630,2.851523,42.801613
2020-945701,2020-01-20,000001,Vente,25000,,,LE ROBOUL,B070,66600,66069,Espira-de-l'Agly,66,,,660690000B0299,,,,,,,,,,,,,0,,,,,T,terres,,,4900,2.850901,42.801477
2020-945701,2020-01-20,000001,Vente,25000,,,LE ROBOUL,B070,66600,66069,Espira-de-l'Agly,66,,,660690000B0300,,,,,,,,,,,,,0,,,,,T,terres,,,720,2.850943,42.801117
2020-945701,2020-01-20,000001,Vente,25000,,,LE ROBOUL,B070,66600,66069,Espira-de-l'Agly,66,,,660690000B0302,,,,,,,,,,,,,0,,,,,T,terres,,,800,2.851344,42.800745
2020-945723,2020-01-22,000001,Vente,1000,,,CORREC D EN TANIOT,B007,66600,66069,Espira-de-l'Agly,66,,,660690000B0702,,,,,,,,,,,,,0,,,,,T,terres,,,2120,2.837591,42.784692
2020-945892,2020-02-06,000001,Vente,184960,612,B,MONT PINS,B059,66600,66069,Espira-de-l'Agly,66,,,660690000A0692,,,,,,,,,,,,,0,1,Maison,136,5,S,sols,,,1000,2.821928,42.810095
2020-945892,2020-02-06,000001,Vente,184960,612,B,MONT PINS,B059,66600,66069,Espira-de-l'Agly,66,,,660690000A0692,,,,,,,,,,,,,0,1,Maison,136,5,AG,terrains d'agrément,PARC,Parc,1614,2.821928,42.810095
2020-945913,2020-01-17,000001,Vente,5000,,,L ORT D AVAIL,B062,66600,66069,Espira-de-l'Agly,66,,,660690000D4135,,,,,,,,,,,,,0,,,,,T,terres,,,956,2.844661,42.772403
2020-945917,2020-01-31,000001,Vente,8000,,,LAS BALMETTES BASSES,B028,66600,66069,Espira-de-l'Agly,66,,,660690000C1010,,,,,,,,,,,,,0,,,,,VI,vignes,,,988,2.81291,42.787809
2020-945917,2020-01-31,000001,Vente,8000,,,LAS BALMETTES BASSES,B028,66600,66069,Espira-de-l'Agly,66,,,660690000C1010,,,,,,,,,,,,,0,,,,,VI,vignes,,,2962,2.81291,42.787809
2020-945917,2020-01-31,000001,Vente,8000,,,LAS BALMETTES BASSES,B028,66600,66069,Espira-de-l'Agly,66,,,660690000C1011,,,,,,,,,,,,,0,,,,,VI,vignes,,,2620,2.812325,42.788
2020-945917,2020-01-31,000001,Vente,8000,,,LAS BALMETTES BASSES,B028,66600,66069,Espira-de-l'Agly,66,,,660690000C1011,,,,,,,,,,,,,0,,,,,VI,vignes,,,7860,2.812325,42.788
2020-945921,2020-01-16,000001,Vente,118000,2,,RUE THIERS,0225,66600,66069,Espira-de-l'Agly,66,,,66069000AH0423,,,11,,,,,,,,,,1,3,Dépendance,,0,,,,,,2.835782,42.777605
2020-945921,2020-01-16,000001,Vente,118000,2,,RUE THIERS,0225,66600,66069,Espira-de-l'Agly,66,,,66069000AH0423,,,12,,,,,,,,,,1,3,Dépendance,,0,,,,,,2.835782,42.777605
2020-945921,2020-01-16,000001,Vente,118000,2,,RUE THIERS,0225,66600,66069,Espira-de-l'Agly,66,,,66069000AH0423,,,23,148.5,,,,,,,,,1,2,Appartement,158,4,,,,,,2.835782,42.777605
2020-946015,2020-01-24,000001,Vente,120000,9,,RUE DAGOBERT,0050,66600,66069,Espira-de-l'Agly,66,,,66069000AH0494,,,,,,,,,,,,,0,1,Maison,70,4,S,sols,,,123,2.838284,42.775931
2020-946043,2020-02-07,000001,Vente,79000,,,PIC CARBONNELL,B065,66600,66069,Espira-de-l'Agly,66,,,660690000D4904,,,,,,,,,,,,,0,,,,,AB,terrains a bâtir,,,59,2.792231,42.777434
2020-946105,2020-01-29,000001,Vente,100,,,JASSE DE LAS BAQUES,B023,66600,66069,Espira-de-l'Agly,66,,,660690000C0202,,,,,,,,,,,,,0,,,,,L,landes,,,515,2.822515,42.798725
2020-946112,2020-01-31,000001,Vente,21000,32,,RUE PIERRE LEFRANC,0180,66600,66069,Espira-de-l'Agly,66,,,66069000AH0301,,,,,,,,,,,,,0,1,Maison,61,4,S,sols,,,45,2.837399,42.777982
2020-946113,2020-02-18,000001,Vente,5000,,,LAS BALMETTES BASSES,B028,66600,66069,Espira-de-l'Agly,66,,,660690000C0969,,,,,,,,,,,,,0,,,,,VI,vignes,,,1700,2.808062,42.791907
2020-946113,2020-02-18,000001,Vente,5000,,,LAS BALMETTES BASSES,B028,66600,66069,Espira-de-l'Agly,66,,,660690000C0972,,,,,,,,,,,,,0,,,,,L,landes,,,720,2.808948,42.792091
2020-946113,2020-02-18,000001,Vente,5000,,,LAS BALMETTES BASSES,B028,66600,66069,Espira-de-l'Agly,66,,,660690000C1285,,,,,,,,,,,,,0,,,,,T,terres,,,16045,2.80875,42.791495
2020-946345,2020-02-26,000001,Vente,100000,2,B,RUE MIRABEAU,0150,66600,66069,Espira-de-l'Agly,66,,,66069000AH0259,,,,,,,,,,,,,0,1,Maison,86,4,S,sols,,,60,2.837368,42.777252
2020-946347,2020-02-14,000001,Vente,7000,,,LOS ESCOUNILS,B050,66600,66069,Espira-de-l'Agly,66,,,660690000A0028,,,,,,,,,,,,,0,,,,,VI,vignes,,,11360,2.818522,42.808905
2020-946360,2020-02-07,000001,Vente,201400,9,,RUE DU DOC COSTE,0060,66600,66069,Espira-de-l'Agly,66,,,66069000AL0179,,,,,,,,,,,,,0,1,Maison,78,4,S,sols,,,262,2.832572,42.77617
2020-946381,2020-01-16,000001,Vente,115200,22,,RUE BERNARD DE CASTELLO,0038,66600,66069,Espira-de-l'Agly,66,,,66069000AE0290,,,,,,,,,,,,,0,1,Maison,83,4,S,sols,,,449,2.83361,42.780046
2020-946400,2020-03-02,000001,Vente,70000,,,RUE NATIONALE,0160,66600,66069,Espira-de-l'Agly,66,,,66069000AH0469,,,,,,,,,,,,,0,,,,,S,sols,,,291,2.835971,42.775919
2020-946426,2020-02-24,000001,Vente,289000,35,,RUE DU DOC COSTE,0060,66600,66069,Espira-de-l'Agly,66,,,66069000AL0147,,,,,,,,,,,,,0,1,Maison,104,3,AG,terrains d'agrément,PARC,Parc,1183,2.830518,42.776971
2020-946426,2020-02-24,000001,Vente,289000,35,,RUE DU DOC COSTE,0060,66600,66069,Espira-de-l'Agly,66,,,66069000AL0147,,,,,,,,,,,,,0,1,Maison,104,3,S,sols,,,800,2.830518,42.776971
2020-946469,2020-02-17,000001,Vente,85000,,,EL PILO,B046,66600,66069,Espira-de-l'Agly,66,,,66069000AI0124,,,,,,,,,,,,,0,,,,,AB,terrains a bâtir,,,530,2.840483,42.769794
2020-946615,2020-03-05,000001,Vente,3000,,,EL GARRIGAR,B040,66600,66069,Espira-de-l'Agly,66,,,66069000AE0042,,,,,,,,,,,,,0,,,,,VI,vignes,,,1031,2.82923,42.780642
2020-946706,2020-03-09,000001,Vente,6500,,,LOS ESCOUNILS,B050,66600,66069,Espira-de-l'Agly,66,,,660690000A0021,,,,,,,,,,,,,0,,,,,VI,vignes,,,19520,2.814978,42.812291
2020-946730,2020-03-10,000001,Vente,61000,6,,RUE DENFERT ROCHEREAU,0055,66600,66069,Espira-de-l'Agly,66,,,66069000AH0025,,,4,65.31,,,,,,,,,1,2,Appartement,65,3,,,,,,2.83742,42.779092
2020-946730,2020-03-10,000001,Vente,61000,6,,RUE DENFERT ROCHEREAU,0055,66600,66069,Espira-de-l'Agly,66,,,66069000AH0025,,,2,,,,,,,,,,1,3,Dépendance,,0,,,,,,2.83742,42.779092
2020-946768,2020-03-26,000001,Vente,55000,25,,RUE PIERRE LEFRANC,0180,66600,66069,Espira-de-l'Agly,66,,,66069000AH0291,,,,,,,,,,,,,0,1,Maison,36,2,S,sols,,,62,2.837461,42.777793
2020-946772,2020-03-26,000001,Vente,52000,26,,RUE PIERRE LEFRANC,0180,66600,66069,Espira-de-l'Agly,66,,,66069000AH0304,,,,,,,,,,,,,0,1,Maison,54,4,S,sols,,,82,2.837252,42.777936
2020-947047,2020-04-27,000001,Vente,68220,2,,RUE DE L INDUSTRIE,0169,66600,66069,Espira-de-l'Agly,66,,,66069000AA0042,,,,,,,,,,,,,0,4,Local industriel. commercial ou assimilé,153,0,S,sols,,,1137,2.792259,42.779272
2020-947047,2020-04-27,000001,Vente,68220,2,,RUE DE L INDUSTRIE,0169,66600,66069,Espira-de-l'Agly,66,,,66069000AA0042,,,,,,,,,,,,,0,1,Maison,45,1,S,sols,,,1137,2.792259,42.779272
2020-947048,2020-04-27,000002,Vente,,2,,RUE DE L INDUSTRIE,0169,66600,66069,Espira-de-l'Agly,66,,,66069000AA0042,,,,,,,,,,,,,0,1,Maison,45,1,S,sols,,,1137,2.792259,42.779272
2020-947048,2020-04-27,000002,Vente,,2,,RUE DE L INDUSTRIE,0169,66600,66069,Espira-de-l'Agly,66,,,66069000AA0042,,,,,,,,,,,,,0,4,Local industriel. commercial ou assimilé,153,0,S,sols,,,1137,2.792259,42.779272
2020-947098,2020-04-16,000001,Vente,330000,55,,RUE DU QUATRE SEPTEMBRE,0200,66600,66069,Espira-de-l'Agly,66,,,66069000AH0522,,,,,,,,,,,,,0,1,Maison,130,8,S,sols,,,1290,,
2020-947220,2020-05-14,000001,Vente,9600,,,JASSE DE LAS BAQUES,B023,66600,66069,Espira-de-l'Agly,66,,,660690000C0234,,,,,,,,,,,,,0,,,,,VI,vignes,,,4200,2.82671,42.796731
2020-947220,2020-05-14,000001,Vente,9600,,,JASSE DE LAS BAQUES,B023,66600,66069,Espira-de-l'Agly,66,,,660690000C0247,,,,,,,,,,,,,0,,,,,VI,vignes,,,7505,2.826131,42.797364
2020-947220,2020-05-14,000001,Vente,9600,,,JASSE DE LAS BAQUES,B023,66600,66069,Espira-de-l'Agly,66,,,660690000C1029,,,,,,,,,,,,,0,,,,,VI,vignes,,,7475,2.825074,42.797285
2020-947391,2020-05-20,000001,Vente,297000,4,,RUE CHARLES TRENET,0044,66600,66069,Espira-de-l'Agly,66,,,66069000AK0131,,,,,,,,,,,,,0,1,Maison,158,5,S,sols,,,623,2.837378,42.773473
2020-947463,2020-05-23,000001,Vente,166250,29,,RUE DE LA FABRIQUE,0092,66600,66069,Espira-de-l'Agly,66,,,66069000AH0665,,,,,,,,,,,,,0,1,Maison,80,3,AB,terrains a bâtir,,,185,2.836939,42.775747
2020-947486,2020-05-20,000001,Vente,79500,,,EL PILO,B046,66600,66069,Espira-de-l'Agly,66,,,66069000AI0094,,,,,,,,,,,,,0,,,,,AB,terrains a bâtir,,,386,2.840905,42.770823
2020-947495,2020-06-09,000001,Vente,250000,,,RUE RIGAUD,0210,66600,66069,Espira-de-l'Agly,66,,,66069000AH0145,,,,,,,,,,,,,0,,,,,S,sols,,,80,2.838559,42.777269
2020-947495,2020-06-09,000001,Vente,250000,,,LAS PLANES,B033,66600,66069,Espira-de-l'Agly,66,,,660690000B0525,,,,,,,,,,,,,0,,,,,VI,vignes,,,8400,2.84222,42.791356
2020-947495,2020-06-09,000001,Vente,250000,,,LAS PLANES,B033,66600,66069,Espira-de-l'Agly,66,,,660690000B0526,,,,,,,,,,,,,0,,,,,VI,vignes,,,8140,2.842062,42.790809
2020-947495,2020-06-09,000001,Vente,250000,,,LAS BALMETTES BASSES,B028,66600,66069,Espira-de-l'Agly,66,,,660690000C0954,,,,,,,,,,,,,0,,,,,VI,vignes,,,8460,2.805281,42.791991
2020-947520,2020-06-09,000001,Vente,58000,3,,IMP DE L AGRICULTURE,0013,66600,66069,Espira-de-l'Agly,66,,,66069000AH0199,,,,,,,,,,,,,0,1,Maison,50,3,S,sols,,,37,2.838071,42.776782
2020-947556,2020-05-25,000001,Vente,96300,4,,RUE ERNEST RENAN,0085,66600,66069,Espira-de-l'Agly,66,,,66069000AE0193,,,,,,,,,,,,,0,1,Maison,50,3,S,sols,,,48,2.835983,42.778061
2020-947583,2020-06-08,000001,Vente,26900,8,,RUE VOLTAIRE,0240,66600,66069,Espira-de-l'Agly,66,,,66069000AH0281,,,,,,,,,,,,,0,1,Maison,40,1,S,sols,,,38,2.837154,42.77762
2020-947642,2020-06-04,000001,Vente,4000,,,LA JULIETTE,B025,66600,66069,Espira-de-l'Agly,66,,,660690000B0055,,,,,,,,,,,,,0,,,,,VI,vignes,,,4560,2.840276,42.80473
2020-947705,2020-06-15,000001,Vente,150000,6,,RUE JEANNE D ARC,0120,66600,66069,Espira-de-l'Agly,66,,,66069000AE0347,,,,,,,,,,,,,0,1,Maison,88,5,S,sols,,,93,2.836574,42.778271
2020-947741,2020-06-11,000001,Vente,75000,,,LOS TAMARIUS,B052,66600,66069,Espira-de-l'Agly,66,,,660690000C0586,,,,,,,,,,,,,0,,,,,VI,vignes,,,19140,2.819823,42.784652
2020-947741,2020-06-11,000001,Vente,75000,,,LOS TAMARIUS,B052,66600,66069,Espira-de-l'Agly,66,,,660690000C0586,,,,,,,,,,,,,0,,,,,VI,vignes,,,19140,2.819823,42.784652
2020-947741,2020-06-11,000001,Vente,75000,,,LOS TAMARIUS,B052,66600,66069,Espira-de-l'Agly,66,,,660690000C0590,,,,,,,,,,,,,0,,,,,VI,vignes,,,5000,2.819632,42.783738
2020-947741,2020-06-11,000001,Vente,75000,,,LOS TAMARIUS,B052,66600,66069,Espira-de-l'Agly,66,,,660690000C1294,,,,,,,,,,,,,0,,,,,VI,vignes,,,7036,2.81758,42.784979
2020-947741,2020-06-11,000001,Vente,75000,,,LOS TAMARIUS,B052,66600,66069,Espira-de-l'Agly,66,,,660690000C1294,,,,,,,,,,,,,0,,,,,VI,vignes,,,15814,2.81758,42.784979
2020-947760,2020-05-20,000001,Vente,147500,28,,RUE DU QUATRE SEPTEMBRE,0200,66600,66069,Espira-de-l'Agly,66,,,66069000AH0253,,,,,,,,,,,,,0,4,Local industriel. commercial ou assimilé,33,0,S,sols,,,88,2.837105,42.777187
2020-947760,2020-05-20,000001,Vente,147500,28,,RUE DU QUATRE SEPTEMBRE,0200,66600,66069,Espira-de-l'Agly,66,,,66069000AH0253,,,,,,,,,,,,,0,2,Appartement,80,3,S,sols,,,88,2.837105,42.777187
2020-947760,2020-05-20,000001,Vente,147500,28,,RUE DU QUATRE SEPTEMBRE,0200,66600,66069,Espira-de-l'Agly,66,,,66069000AH0253,,,,,,,,,,,,,0,2,Appartement,80,3,S,sols,,,88,2.837105,42.777187
2020-947826,2020-06-11,000001,Vente,1000,,,LAS PARETS D EN FELIP,B031,66600,66069,Espira-de-l'Agly,66,,,660690000C0531,,,,,,,,,,,,,0,,,,,L,landes,,,2880,2.826355,42.786333
2020-947826,2020-06-11,000001,Vente,1000,,,LAS PARETS D EN FELIP,B031,66600,66069,Espira-de-l'Agly,66,,,660690000C0532,,,,,,,,,,,,,0,,,,,T,terres,,,1920,2.826303,42.785827
2020-947836,2020-05-18,000001,Vente,284500,7,,RUE DE L AMANDON,0016,66600,66069,Espira-de-l'Agly,66,,,66069000AI0127,,,,,,,,,,,,,0,1,Maison,113,4,S,sols,,,297,2.840121,42.769911
2020-947866,2020-06-25,000001,Vente,247700,11,Q,RUE DE L OLIVERA,0168,66600,66069,Espira-de-l'Agly,66,,,66069000AI0107,,,,,,,,,,,,,0,1,Maison,95,3,S,sols,,,296,2.839433,42.770161
2020-947876,2020-06-08,000001,Vente,132250,,,AV DU 21EME SIECLE,0221,66600,66069,Espira-de-l'Agly,66,,,66069000AI0156,,,,,,,,,,,,,0,,,,,AB,terrains a bâtir,,,575,2.839038,42.771552
2020-947922,2020-07-01,000001,Vente,290000,1,,AV DU BICENTENAIRE,0937,66600,66069,Espira-de-l'Agly,66,,,66069000AL0153,,,,,,,,,,,,,0,1,Maison,124,5,S,sols,,,587,2.831308,42.77683
2020-947928,2020-06-23,000001,Vente,159000,,,IMP ST ANNE,0218,66600,66069,Espira-de-l'Agly,66,,,66069000AH0313,,,,,,,,,,,,,0,,,,,S,sols,,,74,2.837323,42.778089
2020-947928,2020-06-23,000001,Vente,159000,13,,RUE ARAGO,0030,66600,66069,Espira-de-l'Agly,66,,,66069000AH0316,,,,,,,,,,,,,0,1,Maison,149,5,S,sols,,,65,2.837373,42.778233
2020-948104,2020-06-24,000001,Vente,67000,1,,RUE VICTOR HUGO,0230,66600,66069,Espira-de-l'Agly,66,,,66069000AL0236,,,,,,,,,,,,,0,1,Maison,50,3,S,sols,,,53,2.834157,42.776504
2020-948108,2020-06-23,000001,Echange,900,,,LA SANOE,B071,66600,66069,Espira-de-l'Agly,66,,,660690000D0812,,,,,,,,,,,,,0,,,,,J,jardins,POTAG,Jardin potager,180,2.840464,42.777696
2020-948108,2020-06-23,000002,Echange,900,,,LA SANOE,B071,66600,66069,Espira-de-l'Agly,66,,,660690000D0821,,,,,,,,,,,,,0,,,,,J,jardins,POTAG,Jardin potager,140,2.840456,42.777591
2020-948334,2020-07-17,000001,Vente,134000,6,,RUE FOSSA,0095,66600,66069,Espira-de-l'Agly,66,,,66069000AH0216,,,,,,,,,,,,,0,1,Maison,63,3,S,sols,,,63,2.837827,42.777095
2020-948359,2020-07-28,000001,Vente,16000,,,LE ROBOUL,B070,66600,66069,Espira-de-l'Agly,66,,,660690000B0255,,,,,,,,,,,,,0,,,,,T,terres,,,4600,2.853404,42.811507
2020-948359,2020-07-28,000001,Vente,16000,,,LE ROBOUL,B070,66600,66069,Espira-de-l'Agly,66,,,660690000B0256,,,,,,,,,,,,,0,,,,,T,terres,,,16400,2.853709,42.80965
2020-948359,2020-07-28,000001,Vente,16000,,,LE ROBOUL,B070,66600,66069,Espira-de-l'Agly,66,,,660690000B0257,,,,,,,,,,,,,0,,,,,T,terres,,,1000,2.854081,42.810223
2020-948438,2020-07-17,000001,Vente,75000,,,LO MAS SAMPSO,B045,66600,66069,Espira-de-l'Agly,66,,,660690000B0756,,,,,,,,,,,,,0,,,,,VI,vignes,,,16000,2.832579,42.79034
2020-948438,2020-07-17,000001,Vente,75000,,,LO MAS SAMPSO,B045,66600,66069,Espira-de-l'Agly,66,,,660690000B0785,,,,,,,,,,,,,0,,,,,VI,vignes,,,10050,2.832528,42.789194
2020-948438,2020-07-17,000001,Vente,75000,,,JASSE DE LAS BAQUES,B023,66600,66069,Espira-de-l'Agly,66,,,660690000C0233,,,,,,,,,,,,,0,,,,,VI,vignes,,,2250,2.827175,42.796726
2020-948438,2020-07-17,000001,Vente,75000,,,TERRE NEGRE BASSE,B075,66600,66069,Espira-de-l'Agly,66,,,660690000C0261,,,,,,,,,,,,,0,,,,,VI,vignes,,,14800,2.819143,42.797419
2020-948438,2020-07-17,000001,Vente,75000,,,TERRE NEGRE BASSE,B075,66600,66069,Espira-de-l'Agly,66,,,660690000C0261,,,,,,,,,,,,,0,,,,,VI,vignes,,,14800,2.819143,42.797419
2020-948438,2020-07-17,000001,Vente,75000,,,TERRE NEGRE BASSE,B075,66600,66069,Espira-de-l'Agly,66,,,660690000C0262,,,,,,,,,,,,,0,,,,,VI,vignes,,,2600,2.820235,42.797749
2020-948438,2020-07-17,000001,Vente,75000,,,TERRE NEGRE BASSE,B075,66600,66069,Espira-de-l'Agly,66,,,660690000C0263,,,,,,,,,,,,,0,,,,,T,terres,,,550,2.819049,42.798155
2020-948443,2020-07-22,000001,Vente,69000,10,,RUE DE LA POSTE,0190,66600,66069,Espira-de-l'Agly,66,,,66069000AH0430,,,,,,,,,,,,,0,1,Maison,80,2,S,sols,,,50,2.835841,42.777248
2020-948470,2020-08-03,000001,Vente,56000,24,,RUE ARAGO,0030,66600,66069,Espira-de-l'Agly,66,,,66069000AH0131,,,,,,,,,,,,,0,1,Maison,96,6,S,sols,,,137,2.838193,42.777424
2020-948575,2020-06-30,000001,Vente,90000,,,EL PILO,B046,66600,66069,Espira-de-l'Agly,66,,,66069000AK0250,,,,,,,,,,,,,0,,,,,AB,terrains a bâtir,,,400,2.839763,42.771538
2020-948734,2020-08-20,000001,Vente,7000,,,LO PUIG DE SAINTE ETEILLE,B049,66600,66069,Espira-de-l'Agly,66,,,660690000C0095,,,,,,,,,,,,,0,,,,,VI,vignes,,,2100,2.821885,42.802828
2020-948734,2020-08-20,000001,Vente,7000,,,LO PUIG DE SAINTE ETEILLE,B049,66600,66069,Espira-de-l'Agly,66,,,660690000C0096,,,,,,,,,,,,,0,,,,,VI,vignes,,,1990,2.821132,42.802911
2020-948734,2020-08-20,000001,Vente,7000,,,LO PUIG DE SAINTE ETEILLE,B049,66600,66069,Espira-de-l'Agly,66,,,660690000C0097,,,,,,,,,,,,,0,,,,,VI,vignes,,,3780,2.821363,42.803325
2020-948735,2020-08-20,000001,Vente,15000,,,LO PUIG DE SAINTE ETEILLE,B049,66600,66069,Espira-de-l'Agly,66,,,660690000C0090,,,,,,,,,,,,,0,,,,,T,terres,,,350,2.818909,42.802263
2020-948735,2020-08-20,000001,Vente,15000,,,LO PUIG DE SAINTE ETEILLE,B049,66600,66069,Espira-de-l'Agly,66,,,660690000C0100,,,,,,,,,,,,,0,,,,,VI,vignes,,,2740,2.81931,42.803847
2020-948735,2020-08-20,000001,Vente,15000,,,LO PUIG DE SAINTE ETEILLE,B049,66600,66069,Espira-de-l'Agly,66,,,660690000C0101,,,,,,,,,,,,,0,,,,,VI,vignes,,,2640,2.818896,42.803819
2020-948735,2020-08-20,000001,Vente,15000,,,LO PUIG DE SAINTE ETEILLE,B049,66600,66069,Espira-de-l'Agly,66,,,660690000C0102,,,,,,,,,,,,,0,,,,,VI,vignes,,,2880,2.818702,42.804381
2020-948735,2020-08-20,000001,Vente,15000,,,LO PUIG DE SAINTE ETEILLE,B049,66600,66069,Espira-de-l'Agly,66,,,660690000C0106,,,,,,,,,,,,,0,,,,,VI,vignes,,,1480,2.818816,42.80318
2020-948735,2020-08-20,000001,Vente,15000,,,LO PUIG DE SAINTE ETEILLE,B049,66600,66069,Espira-de-l'Agly,66,,,660690000C0112,,,,,,,,,,,,,0,,,,,L,landes,,,300,2.817758,42.801949
2020-948735,2020-08-20,000001,Vente,15000,,,LO PUIG DE SAINTE ETEILLE,B049,66600,66069,Espira-de-l'Agly,66,,,660690000C0115,,,,,,,,,,,,,0,,,,,VI,vignes,,,520,2.818055,42.802382
2020-948735,2020-08-20,000001,Vente,15000,,,LO PUIG DE SAINTE ETEILLE,B049,66600,66069,Espira-de-l'Agly,66,,,660690000C0116,,,,,,,,,,,,,0,,,,,VI,vignes,,,770,2.817896,42.802343
2020-948735,2020-08-20,000001,Vente,15000,,,LAS CABES,B029,66600,66069,Espira-de-l'Agly,66,,,660690000C0380,,,,,,,,,,,,,0,,,,,VI,vignes,,,2267,2.815406,42.789237
2020-948735,2020-08-20,000001,Vente,15000,,,LAS CABES,B029,66600,66069,Espira-de-l'Agly,66,,,660690000C0380,,,,,,,,,,,,,0,,,,,VI,vignes,,,1133,2.815406,42.789237
2020-948735,2020-08-20,000001,Vente,15000,,,LAS CABES,B029,66600,66069,Espira-de-l'Agly,66,,,660690000C0382,,,,,,,,,,,,,0,,,,,VI,vignes,,,2800,2.815199,42.790041
2020-948735,2020-08-20,000001,Vente,15000,,,LAS CABES,B029,66600,66069,Espira-de-l'Agly,66,,,660690000C0382,,,,,,,,,,,,,0,,,,,VI,vignes,,,2800,2.815199,42.790041
2020-948735,2020-08-20,000001,Vente,15000,,,LAS CABES,B029,66600,66069,Espira-de-l'Agly,66,,,660690000C0384,,,,,,,,,,,,,0,,,,,VI,vignes,,,1920,2.816514,42.789335
2020-948735,2020-08-20,000001,Vente,15000,,,LAS BALMETTES BASSES,B028,66600,66069,Espira-de-l'Agly,66,,,660690000C1009,,,,,,,,,,,,,0,,,,,VI,vignes,,,3800,2.813321,42.7876
2020-948735,2020-08-20,000001,Vente,15000,,,LO PUIG DE SAINTE ETEILLE,B049,66600,66069,Espira-de-l'Agly,66,,,660690000C1069,,,,,,,,,,,,,0,,,,,T,terres,,,2420,2.818772,42.803929
2020-948798,2020-08-10,000001,Vente,200000,532,,LE MOULIN,B079,66600,66069,Espira-de-l'Agly,66,,,66069000AH0551,,,,,,,,,,,,,0,1,Maison,212,2,S,sols,,,564,2.841459,42.774806
2020-948798,2020-08-10,000001,Vente,200000,84,,RUE DU QUATRE SEPTEMBRE,0200,66600,66069,Espira-de-l'Agly,66,,,66069000AH0606,,,,,,,,,,,,,0,,,,,S,sols,,,80,2.841347,42.774893
2020-948798,2020-08-10,000001,Vente,200000,,,CAMI DE PERPINYA,B003,66600,66069,Espira-de-l'Agly,66,,,66069000AH0687,,,,,,,,,,,,,0,,,,,S,sols,,,174,2.841637,42.774789
2020-948809,2020-08-13,000001,Vente,3925,,,LE ROBOUL,B070,66600,66069,Espira-de-l'Agly,66,,,660690000B0260,,,,,,,,,,,,,0,,,,,VI,vignes,,,3840,2.854211,42.808439
2020-948809,2020-08-13,000001,Vente,3925,,,LE ROBOUL,B070,66600,66069,Espira-de-l'Agly,66,,,660690000B0837,,,,,,,,,,,,,0,,,,,VI,vignes,,,2701,2.8547,42.808259
2020-948839,2020-08-13,000001,Vente,85000,10,,IMP KLEBER,0130,66600,66069,Espira-de-l'Agly,66,,,66069000AH0380,,,,,,,,,,,,,0,1,Maison,35,2,S,sols,,,41,2.83668,42.777504
2020-948883,2020-08-03,000001,Vente,500,,,LA SANOE,B071,66600,66069,Espira-de-l'Agly,66,,,660690000D0812,,,,,,,,,,,,,0,,,,,J,jardins,POTAG,Jardin potager,180,2.840464,42.777696
2020-948893,2020-08-11,000001,Vente,2500,,,TERRES NEGRES ALTES,B076,66600,66069,Espira-de-l'Agly,66,,,660690000C0839,,,,,,,,,,,,,0,,,,,VI,vignes,,,3780,2.813583,42.798137
2020-948896,2020-08-11,000001,Vente,4800,,,TERRE NEGRE BASSE,B075,66600,66069,Espira-de-l'Agly,66,,,660690000C0281,,,,,,,,,,,,,0,,,,,VI,vignes,,,10600,2.814982,42.798262
2020-948896,2020-08-11,000001,Vente,4800,,,TERRES NEGRES ALTES,B076,66600,66069,Espira-de-l'Agly,66,,,660690000C0842,,,,,,,,,,,,,0,,,,,VI,vignes,,,1125,2.813909,42.797419
2020-948904,2020-08-11,000001,Vente,5500,,,TERRES NEGRES ALTES,B076,66600,66069,Espira-de-l'Agly,66,,,660690000C1081,,,,,,,,,,,,,0,,,,,VI,vignes,,,1210,2.813291,42.797698
2020-948904,2020-08-11,000001,Vente,5500,,,TERRES NEGRES ALTES,B076,66600,66069,Espira-de-l'Agly,66,,,660690000C1081,,,,,,,,,,,,,0,,,,,VI,vignes,,,1210,2.813291,42.797698
2020-948904,2020-08-11,000001,Vente,5500,,,TERRES NEGRES ALTES,B076,66600,66069,Espira-de-l'Agly,66,,,660690000C1082,,,,,,,,,,,,,0,,,,,VI,vignes,,,1390,2.813479,42.7974
2020-948904,2020-08-11,000001,Vente,5500,,,TERRES NEGRES ALTES,B076,66600,66069,Espira-de-l'Agly,66,,,660690000C1082,,,,,,,,,,,,,0,,,,,VI,vignes,,,1390,2.813479,42.7974
2020-948905,2020-08-11,000001,Vente,10300,,,TERRE NEGRE BASSE,B075,66600,66069,Espira-de-l'Agly,66,,,660690000C0282,,,,,,,,,,,,,0,,,,,VI,vignes,,,6600,2.815255,42.797373
2020-948905,2020-08-11,000001,Vente,10300,,,TERRES NEGRES ALTES,B076,66600,66069,Espira-de-l'Agly,66,,,660690000C0838,,,,,,,,,,,,,0,,,,,VI,vignes,,,2420,2.814417,42.798541
2020-948905,2020-08-11,000001,Vente,10300,,,TERRES NEGRES ALTES,B076,66600,66069,Espira-de-l'Agly,66,,,660690000C0838,,,,,,,,,,,,,0,,,,,VI,vignes,,,4850,2.814417,42.798541
2020-948905,2020-08-11,000001,Vente,10300,,,TERRES NEGRES ALTES,B076,66600,66069,Espira-de-l'Agly,66,,,660690000C0846,,,,,,,,,,,,,0,,,,,VI,vignes,,,1800,2.814892,42.797637
2020-948905,2020-08-11,000001,Vente,10300,,,TERRES NEGRES ALTES,B076,66600,66069,Espira-de-l'Agly,66,,,660690000C0848,,,,,,,,,,,,,0,,,,,VI,vignes,,,2900,2.815143,42.796723
2020-948937,2020-08-25,000001,Vente,28000,32,,RUE PIERRE LEFRANC,0180,66600,66069,Espira-de-l'Agly,66,,,66069000AH0301,,,,,,,,,,,,,0,1,Maison,61,4,S,sols,,,45,2.837399,42.777982