id_mutation,date_mutation,numero_disposition,nature_mutation,valeur_fonciere,adresse_numero,adresse_suffixe,adresse_nom_voie,adresse_code_voie,code_postal,code_commune,nom_commune,code_departement,ancien_code_commune,ancien_nom_commune,id_parcelle,ancien_id_parcelle,numero_volume,lot1_numero,lot1_surface_carrez,lot2_numero,lot2_surface_carrez,lot3_numero,lot3_surface_carrez,lot4_numero,lot4_surface_carrez,lot5_numero,lot5_surface_carrez,nombre_lots,code_type_local,type_local,surface_reelle_bati,nombre_pieces_principales,code_nature_culture,nature_culture,code_nature_culture_speciale,nature_culture_speciale,surface_terrain,longitude,latitude
2020-935311,2020-01-06,000001,Vente en l'état futur d'achèvement,291316,1,,RUE ROGER RASCAGNERES,0621,66750,66171,Saint-Cyprien,66,,,66171000AO1633,,,,,,,,,,,,,0,1,Maison,85,4,S,sols,,,221,2.9989,42.616787
2020-935314,2020-01-06,000001,Vente,100000,9001,,RES PORT AU PRINCE,A115,66750,66171,Saint-Cyprien,66,,,66171000AS0355,,,2,,,,,,,,,,1,2,Appartement,22,2,,,,,,3.033043,42.608979
2020-935314,2020-01-06,000001,Vente,100000,9001,,RES PORT AU PRINCE,A115,66750,66171,Saint-Cyprien,66,,,66171000AS0355,,,2,,,,,,,,,,1,3,Dépendance,,0,,,,,,3.033043,42.608979
2020-935314,2020-01-06,000001,Vente,100000,9002,,RES PORT AU PRINCE,A115,66750,66171,Saint-Cyprien,66,,,66171000AS0407,,,11,,,,,,,,,,1,3,Dépendance,,0,,,,,,3.032873,42.608721
2020-935323,2020-01-03,000001,Vente,76000,9001,,RES PORT AU PRINCE,A115,66750,66171,Saint-Cyprien,66,,,66171000AS0355,,,7,27.2,,,,,,,,,1,3,Dépendance,,0,,,,,,3.033043,42.608979
2020-935323,2020-01-03,000001,Vente,76000,9001,,RES PORT AU PRINCE,A115,66750,66171,Saint-Cyprien,66,,,66171000AS0355,,,7,27.2,,,,,,,,,1,2,Appartement,22,2,,,,,,3.033043,42.608979
2020-935323,2020-01-03,000001,Vente,76000,9002,,RES PORT AU PRINCE,A115,66750,66171,Saint-Cyprien,66,,,66171000AS0407,,,61,,,,,,,,,,1,3,Dépendance,,0,,,,,,3.032873,42.608721
2020-935330,2020-01-09,000001,Vente,78000,5,,RUE WATTEAU,0620,66750,66171,Saint-Cyprien,66,,,66171000AE0511,,,1,,,,,,,,,,1,3,Dépendance,,0,,,,,,3.031339,42.63094
2020-935335,2020-01-03,000001,Vente,100003.5,62,,RUE EUGENE LABICHE,0195,66750,66171,Saint-Cyprien,66,,,66171000AH0316,,,,,,,,,,,,,0,1,Maison,64,2,S,sols,,,305,3.026848,42.617744
2020-935335,2020-01-03,000001,Vente,100003.5,62,,RUE EUGENE LABICHE,0195,66750,66171,Saint-Cyprien,66,,,66171000AH0316,,,,,,,,,,,,,0,3,Dépendance,,0,S,sols,,,305,3.026848,42.617744
2020-935394,2020-01-03,000001,Vente,165000,6,,RUE JOINVILLE,0341,66750,66171,Saint-Cyprien,66,,,66171000AO1133,,,,,,,,,,,,,0,1,Maison,60,3,S,sols,,,205,3.001316,42.615039
2020-935409,2020-01-07,000001,Vente,123545,1,,RES LES CASELLAS,A028,66750,66171,Saint-Cyprien,66,,,66171000AD0569,,,4,35.49,,,,,,,,,1,2,Appartement,36,2,,,,,,3.02975,42.630202
2020-935409,2020-01-07,000001,Vente,123545,28,,RES LES CASELLAS,A028,66750,66171,Saint-Cyprien,66,,,66171000AD0590,,,,,,,,,,,,,0,3,Dépendance,,0,S,sols,,,12,3.029433,42.630048
2020-935414,2020-01-10,000001,Vente,82000,9001,,RES DE LA MER,A012,66750,66171,Saint-Cyprien,66,,,66171000AH0163,,,159,53.48,,,,,,,,,1,2,Appartement,53,3,,,,,,3.032479,42.624711
2020-935414,2020-01-10,000001,Vente,82000,895,,LES ROTES,B045,66750,66171,Saint-Cyprien,66,,,66171000AH1221,,,193,,,,,,,,,,1,3,Dépendance,,0,,,,,,3.031504,42.624957
2020-935450,2020-01-03,000001,Vente,55310,9011,,RES MARINA VILLAGE,A106,66750,66171,Saint-Cyprien,66,,,66171000AS0211,,,95,,,,,,,,,,1,2,Appartement,21,1,,,,,,3.034488,42.608009
2020-935450,2020-01-03,000001,Vente,55310,9001,,RES MARINA VILLAGE,A106,66750,66171,Saint-Cyprien,66,,,66171000AS0211,,,219,,,,,,,,,,1,3,Dépendance,,0,,,,,,3.034488,42.608009
2020-935457,2020-01-10,000001,Vente en l'état futur d'achèvement,273000,,,RUE JOUY D'ARNAUD,0157,66750,66171,Saint-Cyprien,66,,,66171000AC0820,,,128,,,,,,,,,,1,,,,,,,,,,3.016878,42.63908
2020-935457,2020-01-10,000001,Vente en l'état futur d'achèvement,273000,,,RUE JOUY D'ARNAUD,0157,66750,66171,Saint-Cyprien,66,,,66171000AC0820,,,159,,,,,,,,,,1,,,,,,,,,,3.016878,42.63908
2020-935457,2020-01-10,000001,Vente en l'état futur d'achèvement,273000,,,RUE JOUY D'ARNAUD,0157,66750,66171,Saint-Cyprien,66,,,66171000AC0820,,,61,,,,,,,,,,1,,,,,,,,,,3.016878,42.63908
2020-935457,2020-01-10,000001,Vente en l'état futur d'achèvement,273000,,,RUE JOUY D'ARNAUD,0157,66750,66171,Saint-Cyprien,66,,,66171000AC0820,,,60,,,,,,,,,,1,,,,,,,,,,3.016878,42.63908
2020-935466,2020-01-10,000001,Vente en l'état futur d'achèvement,220000,,,RUE JOUY D'ARNAUD,0157,66750,66171,Saint-Cyprien,66,,,66171000AC0820,,,131,,,,,,,,,,1,,,,,,,,,,3.016878,42.63908
2020-935466,2020-01-10,000001,Vente en l'état futur d'achèvement,220000,,,RUE JOUY D'ARNAUD,0157,66750,66171,Saint-Cyprien,66,,,66171000AC0820,,,53,,,,,,,,,,1,,,,,,,,,,3.016878,42.63908
2020-935471,2020-01-08,000001,Vente en l'état futur d'achèvement,164548.8,,,RUE JOUY D'ARNAUD,0157,66750,66171,Saint-Cyprien,66,,,66171000AC0820,,,8,,,,,,,,,,1,,,,,,,,,,3.016878,42.63908
2020-935471,2020-01-08,000001,Vente en l'état futur d'achèvement,164548.8,,,RUE JOUY D'ARNAUD,0157,66750,66171,Saint-Cyprien,66,,,66171000AC0820,,,87,,,,,,,,,,1,,,,,,,,,,3.016878,42.63908
2020-935473,2020-01-03,000001,Vente en l'état futur d'achèvement,186960,,,RUE JOUY D'ARNAUD,0157,66750,66171,Saint-Cyprien,66,,,66171000AC0820,,,107,,,,,,,,,,1,,,,,,,,,,3.016878,42.63908
2020-935473,2020-01-03,000001,Vente en l'état futur d'achèvement,186960,,,RUE JOUY D'ARNAUD,0157,66750,66171,Saint-Cyprien,66,,,66171000AC0820,,,24,,,,,,,,,,1,,,,,,,,,,3.016878,42.63908
2020-935474,2020-01-17,000001,Vente,246700,67,,RUE EUGENE LABICHE,0195,66750,66171,Saint-Cyprien,66,,,66171000AH0325,,,,,,,,,,,,,0,1,Maison,86,3,S,sols,,,247,3.027339,42.617946
2020-935475,2020-01-14,000001,Vente en l'état futur d'achèvement,219600,,,RUE JOUY D'ARNAUD,0157,66750,66171,Saint-Cyprien,66,,,66171000AC0820,,,96,,,,,,,,,,1,,,,,,,,,,3.016878,42.63908
2020-935475,2020-01-14,000001,Vente en l'état futur d'achèvement,219600,,,RUE JOUY D'ARNAUD,0157,66750,66171,Saint-Cyprien,66,,,66171000AC0820,,,3,,,,,,,,,,1,,,,,,,,,,3.016878,42.63908
2020-935477,2020-01-17,000001,Vente,85500,9001,,RES TENNIS RESIDENCE,A119,66750,66171,Saint-Cyprien,66,,,66171000AS0634,,,38,,,,,,,,,,1,3,Dépendance,,0,,,,,,3.030616,42.608285
2020-935477,2020-01-17,000001,Vente,85500,9002,,RES TENNIS RESIDENCE,A119,66750,66171,Saint-Cyprien,66,,,66171000AS0634,,,14,27.84,,,,,,,,,1,2,Appartement,28,2,,,,,,3.030616,42.608285
2020-935477,2020-01-17,000001,Vente,85500,9002,,RES TENNIS RESIDENCE,A119,66750,66171,Saint-Cyprien,66,,,66171000AS0634,,,14,27.84,,,,,,,,,1,3,Dépendance,,0,,,,,,3.030616,42.608285
2020-935489,2020-01-07,000001,Vente,105000,9000,,RES AL FOURTY IV,A303,66750,66171,Saint-Cyprien,66,,,66171000AH1065,,,404,,,,,,,,,,1,3,Dépendance,,0,,,,,,3.02932,42.623282
2020-935489,2020-01-07,000001,Vente,105000,9001,,RES AL FOURTY IV,A303,66750,66171,Saint-Cyprien,66,,,66171000AH1065,,,419,,,,,,,,,,1,1,Maison,30,2,,,,,,3.02932,42.623282
2020-935492,2020-01-17,000001,Vente,85000,9001,,RES PORT D ATTACHE,A066,66750,66171,Saint-Cyprien,66,,,66171000AS0209,,,8,,,,,,,,,,1,2,Appartement,22,2,,,,,,3.033991,42.609051
2020-935492,2020-01-17,000001,Vente,85000,9001,,RES PORT D ATTACHE,A066,66750,66171,Saint-Cyprien,66,,,66171000AS0209,,,8,,,,,,,,,,1,3,Dépendance,,0,,,,,,3.033991,42.609051
2020-935492,2020-01-17,000001,Vente,85000,9001,,RES PORT D ATTACHE,A066,66750,66171,Saint-Cyprien,66,,,66171000AS0209,,,166,,,,,,,,,,1,3,Dépendance,,0,,,,,,3.033991,42.609051
2020-935496,2020-01-03,000001,Vente,56000,9999,,RES LE CLOS DE SAINT CYPRIEN,A142,66750,66171,Saint-Cyprien,66,,,66171000AH1154,,,122,,,,,,,,,,1,3,Dépendance,,0,,,,,,3.03342,42.621563
2020-935496,2020-01-03,000001,Vente,56000,9002,,RES LE CLOS DE SAINT CYPRIEN,A142,66750,66171,Saint-Cyprien,66,,,66171000AH1154,,,236,31.66,,,,,,,,,1,2,Appartement,31,2,,,,,,3.03342,42.621563
2020-935512,2020-01-08,000001,Vente,117000,9001,,RES LES CAPELLANES I,A035,66750,66171,Saint-Cyprien,66,,,66171000AS0156,,,162,,,,,,,,,,1,3,Dépendance,,0,,,,,,3.033481,42.612954
2020-935512,2020-01-08,000001,Vente,117000,9001,,RES LES CAPELLANES I,A035,66750,66171,Saint-Cyprien,66,,,66171000AS0156,,,72,,,,,,,,,,1,1,Maison,38,3,,,,,,3.033481,42.612954
2020-935520,2020-01-11,000001,Vente,124000,9001,,RES LES CAPITELLES,A078,66750,66171,Saint-Cyprien,66,,,66171000AT0156,,,128,32.84,,,,,,,,,1,2,Appartement,35,2,,,,,,3.041345,42.59967
2020-935541,2020-01-21,000001,Vente,220000,,,LE VILLAGE,B064,66750,66171,Saint-Cyprien,66,,,66171000AO0021,,,,,,,,,,,,,0,,,,,S,sols,,,320,3.000256,42.617213
2020-935541,2020-01-21,000001,Vente,220000,,,LE VILLAGE,B064,66750,66171,Saint-Cyprien,66,,,66171000AO0022,,,,,,,,,,,,,0,,,,,S,sols,,,19,3.000159,42.61712
2020-935541,2020-01-21,000001,Vente,220000,,,LE VILLAGE,B064,66750,66171,Saint-Cyprien,66,,,66171000AO1361,,,,,,,,,,,,,0,,,,,T,terres,,,143,3.000104,42.617129
2020-935546,2020-01-13,000001,Vente,71300,,,RUE JOUY D'ARNAUD,0157,66750,66171,Saint-Cyprien,66,,,66171000AC0474,,,160,,,,,,,,,,1,4,Local industriel. commercial ou assimilé,10,0,,,,,,3.019118,42.638137
2020-935546,2020-01-13,000001,Vente,71300,,,RUE JOUY D'ARNAUD,0157,66750,66171,Saint-Cyprien,66,,,66171000AC0474,,,43,38.27,,,,,,,,,1,4,Local industriel. commercial ou assimilé,39,0,,,,,,3.019118,42.638137
2020-935547,2020-01-22,000001,Vente,161000,11,,AV LEONARD DE VINCI,9250,66750,66171,Saint-Cyprien,66,,,66171000AI0516,,,,,,,,,,,,,0,1,Maison,120,2,S,sols,,,449,3.015482,42.62234
2020-935568,2020-01-17,000001,Vente,513000,12,,IMP DU LUXEMBOURG,4200,66750,66171,Saint-Cyprien,66,,,66171000AP0961,,,,,,,,,,,,,0,3,Dépendance,,0,S,sols,,,708,3.016291,42.614168
2020-935568,2020-01-17,000001,Vente,513000,12,,IMP DU LUXEMBOURG,4200,66750,66171,Saint-Cyprien,66,,,66171000AP0961,,,,,,,,,,,,,0,1,Maison,143,5,S,sols,,,708,3.016291,42.614168
2020-935582,2020-01-13,000001,Vente,171465,9001,,RES LES REALES,A047,66750,66171,Saint-Cyprien,66,,,66171000AD1407,,,114,,,,,,,,,,1,3,Dépendance,,0,,,,,,3.026749,42.634743
2020-935582,2020-01-13,000001,Vente,171465,9001,,RES LES REALES,A047,66750,66171,Saint-Cyprien,66,,,66171000AD1407,,,51,42.77,,,,,,,,,1,1,Maison,41,3,,,,,,3.026749,42.634743
2020-935589,2020-01-16,000001,Vente,111500,9001,,RES LES CAPELLANES II,A051,66750,66171,Saint-Cyprien,66,,,66171000AS0164,,,64,23.76,,,,,,,,,1,1,Maison,24,2,,,,,,3.034096,42.613132
2020-935589,2020-01-16,000001,Vente,111500,9001,,RES LES CAPELLANES II,A051,66750,66171,Saint-Cyprien,66,,,66171000AS0164,,,128,,,,,,,,,,1,3,Dépendance,,0,,,,,,3.034096,42.613132
2020-935597,2020-01-16,000001,Vente en l'état futur d'achèvement,224760,,,RUE JOUY D'ARNAUD,0157,66750,66171,Saint-Cyprien,66,,,66171000AC0820,,,13,,,,,,,,,,1,,,,,,,,,,3.016878,42.63908
2020-935597,2020-01-16,000001,Vente en l'état futur d'achèvement,224760,,,RUE JOUY D'ARNAUD,0157,66750,66171,Saint-Cyprien,66,,,66171000AC0820,,,99,,,,,,,,,,1,,,,,,,,,,3.016878,42.63908
2020-935613,2020-01-27,000001,Vente,96750,9002,,RES LE CLOS DE SAINT CYPRIEN,A142,66750,66171,Saint-Cyprien,66,,,66171000AH1154,,,258,33.11,,,,,,,,,1,2,Appartement,33,2,,,,,,3.03342,42.621563
2020-935613,2020-01-27,000001,Vente,96750,9999,,RES LE CLOS DE SAINT CYPRIEN,A142,66750,66171,Saint-Cyprien,66,,,66171000AH1154,,,15,,,,,,,,,,1,3,Dépendance,,0,,,,,,3.03342,42.621563
2020-935625,2020-01-06,000001,Vente,96940,,,RUE JOUY D ARNAUD,0157,66750,66171,Saint-Cyprien,66,,,66171000AC0773,,,97,31.54,,,,,,,,,1,2,Appartement,32,2,,,,,,3.016521,42.638619
2020-935625,2020-01-06,000001,Vente,96940,,,RUE JOUY D ARNAUD,0157,66750,66171,Saint-Cyprien,66,,,66171000AC0773,,,9,,,,,,,,,,1,3,Dépendance,,0,,,,,,3.016521,42.638619
2020-935641,2020-01-11,000001,Vente,57500,9001,,RES LES PORTES DE LA MER,A091,66750,66171,Saint-Cyprien,66,,,66171000AD0937,,,52,23.92,,,,,,,,,1,2,Appartement,25,2,,,,,,3.032096,42.627917
2020-935641,2020-01-11,000001,Vente,57500,9001,,RES LES PORTES DE LA MER,A091,66750,66171,Saint-Cyprien,66,,,66171000AD0937,,,52,23.92,,,,,,,,,1,3,Dépendance,,0,,,,,,3.032096,42.627917
2020-935641,2020-01-11,000001,Vente,57500,9001,,RUE DOC SCHWEITZER,0160,66750,66171,Saint-Cyprien,66,,,66171000AD1421,,,32,,,,,,,,,,1,3,Dépendance,,0,,,,,,3.031672,42.627795
2020-935648,2020-01-20,000001,Vente,116000,9002,,RES ATHENA,A029,66750,66171,Saint-Cyprien,66,,,66171000AE0839,,,12,47.82,,,,,,,,,1,3,Dépendance,,0,,,,,,3.035341,42.628716
2020-935648,2020-01-20,000001,Vente,116000,9001,,RES ATHENA,A029,66750,66171,Saint-Cyprien,66,,,66171000AE0839,,,95,,,,,,,,,,1,3,Dépendance,,0,,,,,,3.035341,42.628716
2020-935648,2020-01-20,000001,Vente,116000,9002,,RES ATHENA,A029,66750,66171,Saint-Cyprien,66,,,66171000AE0839,,,12,47.82,,,,,,,,,1,2,Appartement,45,2,,,,,,3.035341,42.628716
2020-935650,2020-01-21,000001,Vente,128685,9002,,RES LE CLOS DE SAINT CYPRIEN,A142,66750,66171,Saint-Cyprien,66,,,66171000AH1154,,,254,33.59,,,,,,,,,1,2,Appartement,33,2,,,,,,3.03342,42.621563
2020-935650,2020-01-21,000001,Vente,128685,9999,,RES LE CLOS DE SAINT CYPRIEN,A142,66750,66171,Saint-Cyprien,66,,,66171000AH1154,,,11,,,,,,,,,,1,3,Dépendance,,0,,,,,,3.03342,42.621563
2020-935651,2020-01-16,000001,Vente en l'état futur d'achèvement,183000,,,RUE JOUY D'ARNAUD,0157,66750,66171,Saint-Cyprien,66,,,66171000AC0820,,,18,,,,,,,,,,1,,,,,,,,,,3.016878,42.63908
2020-935651,2020-01-16,000001,Vente en l'état futur d'achèvement,183000,,,RUE JOUY D'ARNAUD,0157,66750,66171,Saint-Cyprien,66,,,66171000AC0820,,,94,,,,,,,,,,1,,,,,,,,,,3.016878,42.63908
2020-935655,2020-01-17,000001,Vente,109500,9001,,RES PORT AU PRINCE,A115,66750,66171,Saint-Cyprien,66,,,66171000AS0355,,,18,28.18,,,,,,,,,1,2,Appartement,22,2,,,,,,3.033043,42.608979
2020-935655,2020-01-17,000001,Vente,109500,9001,,RES PORT AU PRINCE,A115,66750,66171,Saint-Cyprien,66,,,66171000AS0355,,,18,28.18,,,,,,,,,1,3,Dépendance,,0,,,,,,3.033043,42.608979
2020-935655,2020-01-17,000001,Vente,109500,9002,,RES PORT AU PRINCE,A115,66750,66171,Saint-Cyprien,66,,,66171000AS0407,,,19,,,,,,,,,,1,3,Dépendance,,0,,,,,,3.032873,42.608721
2020-935660,2020-01-22,000001,Vente,117400,19,,RUE COMTESSE DE SEGUR,0126,66750,66171,Saint-Cyprien,66,,,66171000AK0183,,,,,,,,,,,,,0,1,Maison,60,3,S,sols,,,210,3.002547,42.619645
2020-935693,2020-01-23,000001,Vente,116000,9100,,RES VILLA SALIX,A128,66750,66171,Saint-Cyprien,66,,,66171000AH1268,,,11,39.2,,,,,,,,,1,2,Appartement,39,2,,,,,,3.035788,42.61856
2020-935706,2020-01-20,000001,Vente en l'état futur d'achèvement,178261.2,,,RUE JOUY D'ARNAUD,0157,66750,66171,Saint-Cyprien,66,,,66171000AC0820,,,111,,,,,,,,,,1,,,,,,,,,,3.016878,42.63908
2020-935706,2020-01-20,000001,Vente en l'état futur d'achèvement,178261.2,,,RUE JOUY D'ARNAUD,0157,66750,66171,Saint-Cyprien,66,,,66171000AC0820,,,29,,,,,,,,,,1,,,,,,,,,,3.016878,42.63908
2020-935710,2020-01-24,000001,Vente,105000,9001,,RES LA FLORIDE,A007,66750,66171,Saint-Cyprien,66,,,66171000AD1415,,,56,,,,,,,,,,1,2,Appartement,53,2,,,,,,3.033257,42.636672
2020-935712,2020-01-24,000001,Vente,262875,17,,RUE GEORGES DE PORTO RICHE,0250,66750,66171,Saint-Cyprien,66,,,66171000AH0449,,,,,,,,,,,,,0,1,Maison,135,6,S,sols,,,297,3.030107,42.618823
2020-935716,2020-01-24,000001,Vente,223000,2,,RUE LAMARTINE,0373,66750,66171,Saint-Cyprien,66,,,66171000AO1054,,,,,,,,,,,,,0,1,Maison,105,4,S,sols,,,505,3.002298,42.615207
2020-935721,2020-01-10,000001,Vente,73400,9001,,RES LES OLIVIERS,A108,66750,66171,Saint-Cyprien,66,,,66171000AS0336,,,266,,,,,,,,,,1,3,Dépendance,,0,,,,,,3.028043,42.61085
2020-935721,2020-01-10,000001,Vente,73400,9001,,RES LES OLIVIERS,A108,66750,66171,Saint-Cyprien,66,,,66171000AS0336,,,98,,,,,,,,,,1,2,Appartement,24,2,,,,,,3.028043,42.61085
2020-935721,2020-01-10,000001,Vente,73400,9001,,RES LES OLIVIERS,A108,66750,66171,Saint-Cyprien,66,,,66171000AS0336,,,98,,,,,,,,,,1,3,Dépendance,,0,,,,,,3.028043,42.61085
2020-935721,2020-01-10,000001,Vente,73400,9001,,RES LES OLIVIERS,A108,66750,66171,Saint-Cyprien,66,,,66171000AS0336,,,98,,,,,,,,,,1,3,Dépendance,,0,,,,,,3.028043,42.61085
2020-935722,2020-01-22,000001,Vente,30000,5,,RUE HENRI BECQUEREL,0274,66750,66171,Saint-Cyprien,66,,,66171000AS0512,,,24,,,,,,,,,,1,3,Dépendance,,0,,,,,,3.031496,42.613162
2020-935727,2020-01-23,000001,Vente en l'état futur d'achèvement,231000,,,RUE JOUY D'ARNAUD,0157,66750,66171,Saint-Cyprien,66,,,66171000AC0820,,,46,,,,,,,,,,1,,,,,,,,,,3.016878,42.63908
2020-935727,2020-01-23,000001,Vente en l'état futur d'achèvement,231000,,,RUE JOUY D'ARNAUD,0157,66750,66171,Saint-Cyprien,66,,,66171000AC0820,,,123,,,,,,,,,,1,,,,,,,,,,3.016878,42.63908
2020-935766,2020-01-27,000001,Vente,134110,9004,,RES TENNIS RESIDENCE,A119,66750,66171,Saint-Cyprien,66,,,66171000AS0634,,,57,46,,,,,,,,,1,2,Appartement,46,3,,,,,,3.030616,42.608285
2020-935766,2020-01-27,000001,Vente,134110,9001,,RES TENNIS RESIDENCE,A119,66750,66171,Saint-Cyprien,66,,,66171000AS0634,,,48,,,,,,,,,,1,3,Dépendance,,0,,,,,,3.030616,42.608285
2020-935766,2020-01-27,000001,Vente,134110,9004,,RES TENNIS RESIDENCE,A119,66750,66171,Saint-Cyprien,66,,,66171000AS0634,,,57,46,,,,,,,,,1,3,Dépendance,,0,,,,,,3.030616,42.608285
2020-935776,2020-01-24,000001,Vente,60480,500,F,RES LES TERRASSES FLEURIES,A120,66750,66171,Saint-Cyprien,66,,,66171000AH1226,,,128,,,,,,,,,,1,3,Dépendance,,0,,,,,,3.03349,42.620355
2020-935776,2020-01-24,000001,Vente,60480,500,F,RES LES TERRASSES FLEURIES,A120,66750,66171,Saint-Cyprien,66,,,66171000AH1226,,,117,21.18,,,,,,,,,1,2,Appartement,20,2,,,,,,3.03349,42.620355
2020-935814,2020-01-27,000001,Vente,240000,5,,RUE LAUTREAMONT,0380,66750,66171,Saint-Cyprien,66,,,66171000AD0555,,,,,,,,,,,,,0,1,Maison,63,4,S,sols,,,323,3.028879,42.626203
2020-935825,2020-02-04,000001,Vente en l'état futur d'achèvement,267357,10,,RUE ROGER RASCAGNERES,0621,66750,66171,Saint-Cyprien,66,,,66171000AO1628,,,,,,,,,,,,,0,1,Maison,87,4,AB,terrains a bâtir,,,139,2.998684,42.617221
2020-935826,2020-01-14,000001,Vente,1,501,F,RES L ECUME,A259,66750,66171,Saint-Cyprien,66,,,66171000AV0142,,,25,,,,,,,,,,1,3,Dépendance,,0,,,,,,3.033467,42.601185
2020-935826,2020-01-14,000001,Vente,1,501,F,RES L ECUME,A259,66750,66171,Saint-Cyprien,66,,,66171000AV0142,,,47,,,,,,,,,,1,3,Dépendance,,0,,,,,,3.033467,42.601185
2020-935826,2020-01-14,000001,Vente,1,501,F,RES L ECUME,A259,66750,66171,Saint-Cyprien,66,,,66171000AV0142,,,55,,,,,,,,,,1,3,Dépendance,,0,,,,,,3.033467,42.601185
2020-935826,2020-01-14,000001,Vente,1,501,F,RES L ECUME,A259,66750,66171,Saint-Cyprien,66,,,66171000AV0142,,,26,,,,,,,,,,1,3,Dépendance,,0,,,,,,3.033467,42.601185
2020-935826,2020-01-14,000001,Vente,1,501,F,RES L ECUME,A259,66750,66171,Saint-Cyprien,66,,,66171000AV0142,,,27,,,,,,,,,,1,3,Dépendance,,0,,,,,,3.033467,42.601185
2020-935833,2020-01-14,000001,Vente,82650,9001,,RES LES CAPITELLES,A078,66750,66171,Saint-Cyprien,66,,,66171000AT0156,,,138,25.98,,,,,,,,,1,2,Appartement,26,2,,,,,,3.041345,42.59967
2020-935840,2020-01-30,000001,Vente,210000,13,,RUE ST SIMON,0560,66750,66171,Saint-Cyprien,66,,,66171000AE0011,,,,,,,,,,,,,0,3,Dépendance,,0,S,sols,,,265,3.033388,42.634189
2020-935840,2020-01-30,000001,Vente,210000,13,,RUE ST SIMON,0560,66750,66171,Saint-Cyprien,66,,,66171000AE0011,,,,,,,,,,,,,0,2,Appartement,19,1,S,sols,,,265,3.033388,42.634189
2020-935840,2020-01-30,000001,Vente,210000,13,,RUE ST SIMON,0560,66750,66171,Saint-Cyprien,66,,,66171000AE0011,,,,,,,,,,,,,0,1,Maison,50,3,S,sols,,,265,3.033388,42.634189
2020-935840,2020-01-30,000001,Vente,210000,13,,RUE ST SIMON,0560,66750,66171,Saint-Cyprien,66,,,66171000AE0011,,,,,,,,,,,,,0,2,Appartement,19,1,S,sols,,,265,3.033388,42.634189
2020-935848,2020-01-23,000001,Vente,56000,9001,,RES TENNIS RESIDENCE,A119,66750,66171,Saint-Cyprien,66,,,66171000AS0634,,,6,19.08,,,,,,,,,1,2,Appartement,21,1,,,,,,3.030616,42.608285
2020-935848,2020-01-23,000001,Vente,56000,9001,,RES TENNIS RESIDENCE,A119,66750,66171,Saint-Cyprien,66,,,66171000AS0634,,,6,19.08,,,,,,,,,1,3,Dépendance,,0,,,,,,3.030616,42.608285
2020-935848,2020-01-23,000001,Vente,56000,9001,,RES TENNIS RESIDENCE,A119,66750,66171,Saint-Cyprien,66,,,66171000AS0634,,,30,,,,,,,,,,1,3,Dépendance,,0,,,,,,3.030616,42.608285
2020-935887,2020-01-17,000001,Vente,157000,9001,,RES AIGUES MARINES,A067,66750,66171,Saint-Cyprien,66,,,66171000AD1416,,,48,,,,,,,,,,1,1,Maison,32,2,,,,,,3.024603,42.630528
2020-935889,2020-01-17,000001,Vente,65000,9001,,RES LES MIRANDAS I,A063,66750,66171,Saint-Cyprien,66,,,66171000AD0815,,,10,,,,,,,,,,1,2,Appartement,27,2,,,,,,3.028721,42.628277
2020-935889,2020-01-17,000001,Vente,65000,9006,,RES LES MIRANDAS I,A063,66750,66171,Saint-Cyprien,66,,,66171000AD0821,,,,,,,,,,,,,0,3,Dépendance,,0,S,sols,,,11,3.028934,42.628303
2020-935896,2020-01-31,000001,Vente,72480,9002,,RES LES CAPITELLES,A078,66750,66171,Saint-Cyprien,66,,,66171000AT0156,,,259,,,,,,,,,,1,2,Appartement,24,2,,,,,,3.041345,42.59967
2020-935897,2020-01-09,000001,Vente,194000,1,,RUE BOSSUET,0080,66750,66171,Saint-Cyprien,66,,,66171000AE0877,,,64,,,,,,,,,,1,3,Dépendance,,0,,,,,,3.032856,42.63237
2020-935897,2020-01-09,000001,Vente,194000,1,,RUE BOSSUET,0080,66750,66171,Saint-Cyprien,66,,,66171000AE0877,,,70,,,,,,,,,,1,2,Appartement,63,3,,,,,,3.032856,42.63237
2020-935912,2020-01-23,000001,Vente en l'état futur d'achèvement,215000,3,,RUE LACORDAIRE,0372,66750,66171,Saint-Cyprien,66,,,66171000AH0646,,,19,,,,,,,,,,1,,,,,,,,,,3.032013,42.620199
2020-935912,2020-01-23,000001,Vente en l'état futur d'achèvement,215000,3,,RUE LACORDAIRE,0372,66750,66171,Saint-Cyprien,66,,,66171000AH0646,,,1,,,,,,,,,,1,,,,,,,,,,3.032013,42.620199
2020-935920,2020-01-31,000001,Vente,88500,9999,,RES LES PIERRES DE JADE,A570,66750,66171,Saint-Cyprien,66,,,66171000AS0735,,,12,,,,,,,,,,1,3,Dépendance,,0,,,,,,3.032647,42.607506
2020-935920,2020-01-31,000001,Vente,88500,9001,,RES LES PIERRES DE JADE,A570,66750,66171,Saint-Cyprien,66,,,66171000AS0735,,,366,30.11,,,,,,,,,1,2,Appartement,31,2,,,,,,3.032647,42.607506
2020-935922,2020-01-30,000001,Vente,133000,9999,,RES CATALONA,A231,66750,66171,Saint-Cyprien,66,,,66171000AS0504,,,138,,,,,,,,,,1,3,Dépendance,,0,,,,,,3.040161,42.606044
2020-935922,2020-01-30,000001,Vente,133000,502,F,RES CATALONA,A231,66750,66171,Saint-Cyprien,66,,,66171000AS0504,,,76,42.02,,,,,,,,,1,2,Appartement,42,3,,,,,,3.040161,42.606044
2020-935927,2020-01-31,000001,Vente en l'état futur d'achèvement,268000,,,RUE JOUY D'ARNAUD,0157,66750,66171,Saint-Cyprien,66,,,66171000AC0820,,,124,,,,,,,,,,1,,,,,,,,,,3.016878,42.63908
2020-935927,2020-01-31,000001,Vente en l'état futur d'achèvement,268000,,,RUE JOUY D'ARNAUD,0157,66750,66171,Saint-Cyprien,66,,,66171000AC0820,,,48,,,,,,,,,,1,,,,,,,,,,3.016878,42.63908
2020-935942,2020-01-17,000001,Vente,134000,9001,,LES MARINAS DE LA LAGUNE,A092,66750,66171,Saint-Cyprien,66,,,66171000AS0919,,,67,,,,,,,,,,1,3,Dépendance,,0,,,,,,3.039274,42.606761
2020-935942,2020-01-17,000001,Vente,134000,9001,,LES MARINAS DE LA LAGUNE,A092,66750,66171,Saint-Cyprien,66,,,66171000AS0919,,,19,28.86,,,,,,,,,1,3,Dépendance,,0,,,,,,3.039274,42.606761
2020-935942,2020-01-17,000001,Vente,134000,9001,,LES MARINAS DE LA LAGUNE,A092,66750,66171,Saint-Cyprien,66,,,66171000AS0919,,,19,28.86,,,,,,,,,1,2,Appartement,23,2,,,,,,3.039274,42.606761
2020-935942,2020-01-17,000001,Vente,134000,9001,,LES MARINAS DE LA LAGUNE,A092,66750,66171,Saint-Cyprien,66,,,66171000AS0919,,,19,28.86,,,,,,,,,1,3,Dépendance,,0,,,,,,3.039274,42.606761
2020-935942,2020-01-17,000001,Vente,134000,9001,,LES MARINAS DE LA LAGUNE,A092,66750,66171,Saint-Cyprien,66,,,66171000AS0919,,,19,28.86,,,,,,,,,1,3,Dépendance,,0,,,,,,3.039274,42.606761
2020-935957,2020-02-07,000001,Vente,82390,9001,,RES DE LA MER,A012,66750,66171,Saint-Cyprien,66,,,66171000AH0163,,,163,40.08,,,,,,,,,1,2,Appartement,40,2,,,,,,3.032479,42.624711
2020-935957,2020-02-07,000001,Vente,82390,895,,LES ROTES,B045,66750,66171,Saint-Cyprien,66,,,66171000AH1221,,,224,,,,,,,,,,1,3,Dépendance,,0,,,,,,3.031504,42.624957
2020-935959,2020-01-30,000001,Vente,80000,,,LE VILLAGE,B064,66750,66171,Saint-Cyprien,66,,,66171000AO1602,,,,,,,,,,,,,0,,,,,S,sols,,,341,2.999185,42.61677