id_mutation,date_mutation,numero_disposition,nature_mutation,valeur_fonciere,adresse_numero,adresse_suffixe,adresse_nom_voie,adresse_code_voie,code_postal,code_commune,nom_commune,code_departement,ancien_code_commune,ancien_nom_commune,id_parcelle,ancien_id_parcelle,numero_volume,lot1_numero,lot1_surface_carrez,lot2_numero,lot2_surface_carrez,lot3_numero,lot3_surface_carrez,lot4_numero,lot4_surface_carrez,lot5_numero,lot5_surface_carrez,nombre_lots,code_type_local,type_local,surface_reelle_bati,nombre_pieces_principales,code_nature_culture,nature_culture,code_nature_culture_speciale,nature_culture_speciale,surface_terrain,longitude,latitude
2020-945839,2020-01-10,000002,Vente,293000,,,PLA DE MONTORIOL,B025,66130,66185,Saint-Michel-de-Llotes,66,,,661850000B0666,,,,,,,,,,,,,0,,,,,TP,terres plantées,,,1160,2.62379,42.65373
2020-945839,2020-01-10,000002,Vente,293000,,,PLA DE MONTORIOL,B025,66130,66185,Saint-Michel-de-Llotes,66,,,661850000B0667,,,,,,,,,,,,,0,,,,,TP,terres plantées,,,845,2.623965,42.653642
2020-945839,2020-01-10,000002,Vente,293000,,,PLA DE MONTORIOL,B025,66130,66185,Saint-Michel-de-Llotes,66,,,661850000B1106,,,,,,,,,,,,,0,,,,,TP,terres plantées,,,5199,2.624899,42.654446
2020-946068,2020-02-11,000001,Vente,17000,,,BALLTORTE,B003,66130,66185,Saint-Michel-de-Llotes,66,,,661850000A0383,,,,,,,,,,,,,0,,,,,VE,vergers,ABRIC,Abricotiers,2840,2.619841,42.652863
2020-946595,2020-03-03,000001,Vente,334800,5,,CAMI DE LAS MOUILLERES,7400,66130,66185,Saint-Michel-de-Llotes,66,,,661850000A1135,,,,,,,,,,,,,0,1,Maison,144,6,S,sols,,,1201,2.622148,42.65193
2020-946595,2020-03-03,000001,Vente,334800,5,,CAMI DE LAS MOUILLERES,7400,66130,66185,Saint-Michel-de-Llotes,66,,,661850000A1135,,,,,,,,,,,,,0,3,Dépendance,,0,S,sols,,,1201,2.622148,42.65193
2020-946733,2020-04-01,000001,Vente,112000,,,LO BAC,B015,66130,66185,Saint-Michel-de-Llotes,66,,,661850000A0746,,,,,,,,,,,,,0,,,,,BT,taillis simples,,,55,2.617053,42.632352
2020-946733,2020-04-01,000001,Vente,112000,2,,LO BAC,B015,66130,66185,Saint-Michel-de-Llotes,66,,,661850000A0747,,,,,,,,,,,,,0,1,Maison,60,2,S,sols,,,260,2.617218,42.632565
2020-946733,2020-04-01,000001,Vente,112000,,,FONT DEL DIDOT,B009,66130,66185,Saint-Michel-de-Llotes,66,,,661850000A0767,,,,,,,,,,,,,0,,,,,BT,taillis simples,,,7930,2.617368,42.632648
2020-947035,2020-04-30,000002,Vente,170000,2,,CAMI DE LAS MOUILLERES,7400,66130,66185,Saint-Michel-de-Llotes,66,,,661850000A1189,,,,,,,,,,,,,0,1,Maison,86,4,,,,,,2.620978,42.653918
2020-947073,2020-04-30,000001,Vente,447500,,,MAS D EN GRAU,B016,66130,66185,Saint-Michel-de-Llotes,66,,,661850000B0399,,,,,,,,,,,,,0,,,,,VE,vergers,ABRIC,Abricotiers,440,2.63317,42.635809
2020-947073,2020-04-30,000001,Vente,447500,,,MAS D EN GRAU,B016,66130,66185,Saint-Michel-de-Llotes,66,,,661850000B0401,,,,,,,,,,,,,0,,,,,T,terres,,,2360,2.633568,42.636159
2020-947073,2020-04-30,000001,Vente,447500,,,MAS D EN GRAU,B016,66130,66185,Saint-Michel-de-Llotes,66,,,661850000B0403,,,,,,,,,,,,,0,,,,,T,terres,,,1515,2.633108,42.636575
2020-947073,2020-04-30,000001,Vente,447500,,,MAS D EN GRAU,B016,66130,66185,Saint-Michel-de-Llotes,66,,,661850000B0404,,,,,,,,,,,,,0,,,,,T,terres,,,855,2.633433,42.6368
2020-947073,2020-04-30,000001,Vente,447500,95,,MAS D EN GRAU,B016,66130,66185,Saint-Michel-de-Llotes,66,,,661850000B1082,,,,,,,,,,,,,0,1,Maison,149,4,T,terres,,,1815,2.632988,42.636218
2020-947073,2020-04-30,000001,Vente,447500,95,,MAS D EN GRAU,B016,66130,66185,Saint-Michel-de-Llotes,66,,,661850000B1082,,,,,,,,,,,,,0,3,Dépendance,,0,T,terres,,,1815,2.632988,42.636218
2020-947073,2020-04-30,000001,Vente,447500,95,,MAS D EN GRAU,B016,66130,66185,Saint-Michel-de-Llotes,66,,,661850000B1082,,,,,,,,,,,,,0,3,Dépendance,,0,S,sols,,,1250,2.632988,42.636218
2020-947073,2020-04-30,000001,Vente,447500,95,,MAS D EN GRAU,B016,66130,66185,Saint-Michel-de-Llotes,66,,,661850000B1082,,,,,,,,,,,,,0,1,Maison,149,4,S,sols,,,1250,2.632988,42.636218
2020-947165,2020-05-15,000001,Vente,7000,,,A L HORT D EN GILL,B011,66130,66185,Saint-Michel-de-Llotes,66,,,661850000B0626,,,,,,,,,,,,,0,,,,,T,terres,,,1190,2.628972,42.659039
2020-947871,2020-05-25,000001,Vente,128125,,,LAS BASSES,B012,66130,66185,Saint-Michel-de-Llotes,66,,,661850000A1176,,,,,,,,,,,,,0,,,,,AB,terrains a bâtir,,,59,2.621527,42.652739
2020-947871,2020-05-25,000001,Vente,128125,,,LAS BASSES,B012,66130,66185,Saint-Michel-de-Llotes,66,,,661850000A1177,,,,,,,,,,,,,0,,,,,AB,terrains a bâtir,,,966,2.621784,42.652604
2020-947892,2020-05-06,000001,Vente,100625,,,LAS BASSES,B012,66130,66185,Saint-Michel-de-Llotes,66,,,661850000A1182,,,,,,,,,,,,,0,,,,,AB,terrains a bâtir,,,806,2.622337,42.652599
2020-947911,2020-05-06,000001,Vente,103625,,,LAS BASSES,B012,66130,66185,Saint-Michel-de-Llotes,66,,,661850000A1173,,,,,,,,,,,,,0,,,,,AB,terrains a bâtir,,,828,2.6221,42.653005
2020-948579,2020-07-03,000001,Vente,109250,,,LAS BASSES,B012,66130,66185,Saint-Michel-de-Llotes,66,,,661850000A1171,,,,,,,,,,,,,0,,,,,AB,terrains a bâtir,,,874,2.622404,42.65324
2020-948855,2020-07-27,000001,Vente,238000,5002,F,VC VEINAT DE LAS BASSES,0840,66130,66185,Saint-Michel-de-Llotes,66,,,661850000A1102,,,,,,,,,,,,,0,1,Maison,100,4,S,sols,,,500,2.622178,42.655523
2020-948855,2020-07-27,000001,Vente,238000,5002,F,VC VEINAT DE LAS BASSES,0840,66130,66185,Saint-Michel-de-Llotes,66,,,661850000A1102,,,,,,,,,,,,,0,1,Maison,100,4,T,terres,,,940,2.622178,42.655523
2020-948855,2020-07-27,000001,Vente,238000,,,LAS BASSES,B012,66130,66185,Saint-Michel-de-Llotes,66,,,661850000A1104,,,,,,,,,,,,,0,,,,,S,sols,,,152,2.622638,42.65564
2020-949006,2020-08-06,000001,Vente,225000,,,AS MASUS,B002,66130,66185,Saint-Michel-de-Llotes,66,,,661850000B0195,,,,,,,,,,,,,0,,,,,L,landes,,,2680,2.639479,42.64418
2020-949006,2020-08-06,000001,Vente,225000,,,AS MASUS,B002,66130,66185,Saint-Michel-de-Llotes,66,,,661850000B0196,,,,,,,,,,,,,0,,,,,L,landes,,,2410,2.64009,42.643158
2020-949006,2020-08-06,000001,Vente,225000,,,AS MASUS,B002,66130,66185,Saint-Michel-de-Llotes,66,,,661850000B0197,,,,,,,,,,,,,0,,,,,L,landes,,,4080,2.63891,42.64333
2020-949006,2020-08-06,000001,Vente,225000,,,AS MASUS,B002,66130,66185,Saint-Michel-de-Llotes,66,,,661850000B0198,,,,,,,,,,,,,0,,,,,L,landes,,,4700,2.638398,42.643869
2020-949006,2020-08-06,000001,Vente,225000,,,AS MASUS,B002,66130,66185,Saint-Michel-de-Llotes,66,,,661850000B0200,,,,,,,,,,,,,0,,,,,BT,taillis simples,,,11330,2.637061,42.643766
2020-949006,2020-08-06,000001,Vente,225000,,,AS MASUS,B002,66130,66185,Saint-Michel-de-Llotes,66,,,661850000B0222,,,,,,,,,,,,,0,,,,,BT,taillis simples,,,6670,2.640087,42.642799
2020-949006,2020-08-06,000001,Vente,225000,,,AS MASUS,B002,66130,66185,Saint-Michel-de-Llotes,66,,,661850000B0223,,,,,,,,,,,,,0,,,,,L,landes,,,48580,2.640536,42.643559
2020-949006,2020-08-06,000001,Vente,225000,,,MAS D EN PEYROT,B020,66130,66185,Saint-Michel-de-Llotes,66,,,661850000B0225,,,,,,,,,,,,,0,,,,,L,landes,,,1520,2.643351,42.640819
2020-949006,2020-08-06,000001,Vente,225000,,,MAS D EN PEYROT,B020,66130,66185,Saint-Michel-de-Llotes,66,,,661850000B0226,,,,,,,,,,,,,0,,,,,BT,taillis simples,,,3850,2.644144,42.641156
2020-949006,2020-08-06,000001,Vente,225000,,,MAS D EN PEYROT,B020,66130,66185,Saint-Michel-de-Llotes,66,,,661850000B0227,,,,,,,,,,,,,0,,,,,L,landes,,,8600,2.644631,42.641904
2020-949006,2020-08-06,000001,Vente,225000,,,MAS D EN PEYROT,B020,66130,66185,Saint-Michel-de-Llotes,66,,,661850000B0231,,,,,,,,,,,,,0,,,,,BT,taillis simples,,,180,2.64607,42.639992
2020-949006,2020-08-06,000001,Vente,225000,,,MAS D EN PEYROT,B020,66130,66185,Saint-Michel-de-Llotes,66,,,661850000B0235,,,,,,,,,,,,,0,,,,,L,landes,,,10100,2.643575,42.640313
2020-949006,2020-08-06,000001,Vente,225000,,,MAS D EN PEYROT,B020,66130,66185,Saint-Michel-de-Llotes,66,,,661850000B0236,,,,,,,,,,,,,0,,,,,L,landes,,,460,2.643664,42.640209
2020-949006,2020-08-06,000001,Vente,225000,,,MAS D EN PEYROT,B020,66130,66185,Saint-Michel-de-Llotes,66,,,661850000B0237,,,,,,,,,,,,,0,,,,,L,landes,,,300,2.642772,42.640331
2020-949006,2020-08-06,000001,Vente,225000,,,MAS D EN PEYROT,B020,66130,66185,Saint-Michel-de-Llotes,66,,,661850000B0238,,,,,,,,,,,,,0,,,,,L,landes,,,20,2.642427,42.640133
2020-949006,2020-08-06,000001,Vente,225000,,,MAS D EN PEYROT,B020,66130,66185,Saint-Michel-de-Llotes,66,,,661850000B0239,,,,,,,,,,,,,0,,,,,L,landes,,,75,2.642561,42.64008
2020-949006,2020-08-06,000001,Vente,225000,,,MAS D EN PEYROT,B020,66130,66185,Saint-Michel-de-Llotes,66,,,661850000B0292,,,,,,,,,,,,,0,,,,,T,terres,,,4370,2.64263,42.638633
2020-949006,2020-08-06,000001,Vente,225000,,,MAS D EN PEYROT,B020,66130,66185,Saint-Michel-de-Llotes,66,,,661850000B0293,,,,,,,,,,,,,0,,,,,T,terres,,,5935,2.642855,42.638026
2020-949006,2020-08-06,000001,Vente,225000,,,MAS D EN PEYROT,B020,66130,66185,Saint-Michel-de-Llotes,66,,,661850000B0294,,,,,,,,,,,,,0,,,,,BT,taillis simples,,,22845,2.644034,42.638964
2020-949006,2020-08-06,000001,Vente,225000,,,MAS D EN PEYROT,B020,66130,66185,Saint-Michel-de-Llotes,66,,,661850000B0294,,,,,,,,,,,,,0,,,,,BT,taillis simples,,,22845,2.644034,42.638964
2020-949006,2020-08-06,000001,Vente,225000,,,MAS D EN PEYROT,B020,66130,66185,Saint-Michel-de-Llotes,66,,,661850000B0295,,,,,,,,,,,,,0,,,,,BT,taillis simples,,,55220,2.645489,42.637299
2020-949006,2020-08-06,000001,Vente,225000,,,MAS D EN PEYROT,B020,66130,66185,Saint-Michel-de-Llotes,66,,,661850000B0295,,,,,,,,,,,,,0,,,,,BT,taillis simples,,,55220,2.645489,42.637299
2020-949006,2020-08-06,000001,Vente,225000,,,MAS D EN PEYROT,B020,66130,66185,Saint-Michel-de-Llotes,66,,,661850000B0296,,,,,,,,,,,,,0,,,,,BT,taillis simples,,,2165,2.643683,42.634856
2020-949006,2020-08-06,000001,Vente,225000,,,A FOURNAS,B010,66130,66185,Saint-Michel-de-Llotes,66,,,661850000B0297,,,,,,,,,,,,,0,,,,,BT,taillis simples,,,50720,2.64026,42.634786
2020-949006,2020-08-06,000001,Vente,225000,,,A FOURNAS,B010,66130,66185,Saint-Michel-de-Llotes,66,,,661850000B0297,,,,,,,,,,,,,0,,,,,BT,taillis simples,,,50720,2.64026,42.634786
2020-949006,2020-08-06,000001,Vente,225000,,,A FOURNAS,B010,66130,66185,Saint-Michel-de-Llotes,66,,,661850000B0300,,,,,,,,,,,,,0,,,,,BT,taillis simples,,,25490,2.640732,42.636075
2020-949006,2020-08-06,000001,Vente,225000,,,A FOURNAS,B010,66130,66185,Saint-Michel-de-Llotes,66,,,661850000B0300,,,,,,,,,,,,,0,,,,,BT,taillis simples,,,25490,2.640732,42.636075
2020-949006,2020-08-06,000001,Vente,225000,,,A FOURNAS,B010,66130,66185,Saint-Michel-de-Llotes,66,,,661850000B0306,,,,,,,,,,,,,0,,,,,BT,taillis simples,,,15840,2.643498,42.636812
2020-949006,2020-08-06,000001,Vente,225000,,,A FOURNAS,B010,66130,66185,Saint-Michel-de-Llotes,66,,,661850000B0307,,,,,,,,,,,,,0,,,,,L,landes,,,12450,2.643773,42.637317
2020-949006,2020-08-06,000001,Vente,225000,,,A FOURNAS,B010,66130,66185,Saint-Michel-de-Llotes,66,,,661850000B0308,,,,,,,,,,,,,0,,,,,L,landes,,,5220,2.641842,42.63696
2020-949006,2020-08-06,000001,Vente,225000,,,A FOURNAS,B010,66130,66185,Saint-Michel-de-Llotes,66,,,661850000B0336,,,,,,,,,,,,,0,,,,,L,landes,,,2380,2.639065,42.636406
2020-949282,2020-08-21,000001,Vente,45000,,,LAS BASSES,B012,66130,66185,Saint-Michel-de-Llotes,66,,,661850000A0023,,,,,,,,,,,,,0,,,,,VE,vergers,ABRIC,Abricotiers,855,2.609294,42.655549
2020-949282,2020-08-21,000001,Vente,45000,,,LAS BASSES,B012,66130,66185,Saint-Michel-de-Llotes,66,,,661850000A0024,,,,,,,,,,,,,0,,,,,VE,vergers,ABRIC,Abricotiers,515,2.608902,42.655313
2020-949282,2020-08-21,000001,Vente,45000,,,LAS BASSES,B012,66130,66185,Saint-Michel-de-Llotes,66,,,661850000A0025,,,,,,,,,,,,,0,,,,,VE,vergers,ABRIC,Abricotiers,185,2.608729,42.655268
2020-949282,2020-08-21,000001,Vente,45000,,,LAS BASSES,B012,66130,66185,Saint-Michel-de-Llotes,66,,,661850000A0026,,,,,,,,,,,,,0,,,,,VE,vergers,ABRIC,Abricotiers,370,2.608439,42.655168
2020-949282,2020-08-21,000001,Vente,45000,,,LAS BASSES,B012,66130,66185,Saint-Michel-de-Llotes,66,,,661850000A0028,,,,,,,,,,,,,0,,,,,VE,vergers,ABRIC,Abricotiers,7495,2.607933,42.654221
2020-949282,2020-08-21,000001,Vente,45000,,,LAS BASSES,B012,66130,66185,Saint-Michel-de-Llotes,66,,,661850000A0911,,,,,,,,,,,,,0,,,,,VE,vergers,ABRIC,Abricotiers,8714,2.608577,42.654779
2020-949282,2020-08-21,000001,Vente,45000,,,LAS BASSES,B012,66130,66185,Saint-Michel-de-Llotes,66,,,661850000A0912,,,,,,,,,,,,,0,,,,,VE,vergers,ABRIC,Abricotiers,5266,2.609275,42.655021
2020-949752,2020-09-30,000001,Vente,25935,,,PLA DE MONTORIOL,B025,66130,66185,Saint-Michel-de-Llotes,66,,,661850000B0779,,,,,,,,,,,,,0,,,,,VE,vergers,PECHE,Pêchers,4595,2.633266,42.653193
2020-949752,2020-09-30,000001,Vente,25935,,,PLA DE MONTORIOL,B025,66130,66185,Saint-Michel-de-Llotes,66,,,661850000B0787,,,,,,,,,,,,,0,,,,,VE,vergers,PECHE,Pêchers,3015,2.633424,42.65447
2020-949752,2020-09-30,000001,Vente,25935,,,PLA DE MONTORIOL,B025,66130,66185,Saint-Michel-de-Llotes,66,,,661850000B0788,,,,,,,,,,,,,0,,,,,VE,vergers,PECHE,Pêchers,3530,2.633092,42.654575
2020-949752,2020-09-30,000001,Vente,25935,,,PLA DE MONTORIOL,B025,66130,66185,Saint-Michel-de-Llotes,66,,,661850000B0954,,,,,,,,,,,,,0,,,,,VI,vignes,,,1285,2.633611,42.654604
2020-949752,2020-09-30,000001,Vente,25935,,,PLA DE MONTORIOL,B025,66130,66185,Saint-Michel-de-Llotes,66,,,661850000B0955,,,,,,,,,,,,,0,,,,,VI,vignes,,,1285,2.633742,42.654594
2020-949752,2020-09-30,000001,Vente,25935,,,PLA DE MONTORIOL,B025,66130,66185,Saint-Michel-de-Llotes,66,,,661850000B1022,,,,,,,,,,,,,0,,,,,VE,vergers,PECHE,Pêchers,3580,2.633554,42.653368
2020-950429,2020-10-26,000001,Vente,112750,,,LAS BASSES,B012,66130,66185,Saint-Michel-de-Llotes,66,,,661850000A1174,,,,,,,,,,,,,0,,,,,AB,terrains a bâtir,,,63,2.621751,42.652906
2020-950429,2020-10-26,000001,Vente,112750,,,LAS BASSES,B012,66130,66185,Saint-Michel-de-Llotes,66,,,661850000A1175,,,,,,,,,,,,,0,,,,,AB,terrains a bâtir,,,839,2.621887,42.652828
2020-950698,2020-11-16,000001,Vente,4500,,,BALLTORTE,B003,66130,66185,Saint-Michel-de-Llotes,66,,,661850000A0394,,,,,,,,,,,,,0,,,,,T,terres,,,5730,2.6161,42.652932
2020-950698,2020-11-16,000001,Vente,4500,,,BALLTORTE,B003,66130,66185,Saint-Michel-de-Llotes,66,,,661850000A0410,,,,,,,,,,,,,0,,,,,T,terres,,,720,2.616072,42.652343
2020-950698,2020-11-16,000001,Vente,4500,,,BALLTORTE,B003,66130,66185,Saint-Michel-de-Llotes,66,,,661850000A0411,,,,,,,,,,,,,0,,,,,L,landes,,,1860,2.615982,42.651844
2020-950923,2020-12-03,000001,Vente,149000,24,,A L EGLISE,B007,66130,66185,Saint-Michel-de-Llotes,66,,,661850000A0239,,,,,,,,,,,,,0,1,Maison,65,4,S,sols,,,385,2.624561,42.647238
2020-951018,2020-12-01,000001,Vente,105250,,,LAS BASSES,B012,66130,66185,Saint-Michel-de-Llotes,66,,,661850000A1180,,,,,,,,,,,,,0,,,,,AB,terrains a bâtir,,,842,2.622021,42.652335
