id_mutation,date_mutation,numero_disposition,nature_mutation,valeur_fonciere,adresse_numero,adresse_suffixe,adresse_nom_voie,adresse_code_voie,code_postal,code_commune,nom_commune,code_departement,ancien_code_commune,ancien_nom_commune,id_parcelle,ancien_id_parcelle,numero_volume,lot1_numero,lot1_surface_carrez,lot2_numero,lot2_surface_carrez,lot3_numero,lot3_surface_carrez,lot4_numero,lot4_surface_carrez,lot5_numero,lot5_surface_carrez,nombre_lots,code_type_local,type_local,surface_reelle_bati,nombre_pieces_principales,code_nature_culture,nature_culture,code_nature_culture_speciale,nature_culture_speciale,surface_terrain,longitude,latitude
2020-985116,2020-01-17,000001,Vente,2250,,,CHATILLON,B030,69790,69182,Saint-Bonnet-des-Bruyères,69,,,69182000AL0196,,,,,,,,,,,,,0,,,,,BR,futaies résineuses,,,1669,4.458997,46.253755
2020-985116,2020-01-17,000001,Vente,2250,,,CHATILLON,B030,69790,69182,Saint-Bonnet-des-Bruyères,69,,,69182000AL0196,,,,,,,,,,,,,0,,,,,BR,futaies résineuses,,,4400,4.458997,46.253755
2020-985116,2020-01-17,000001,Vente,2250,,,CHATILLON,B030,69790,69182,Saint-Bonnet-des-Bruyères,69,,,69182000AL0196,,,,,,,,,,,,,0,,,,,L,landes,,,3930,4.458997,46.253755
2020-985572,2020-02-21,000001,Vente,99000,5171,,LES PLATIERES,B089,69790,69182,Saint-Bonnet-des-Bruyères,69,,,69182000AC0365,,,,,,,,,,,,,0,1,Maison,70,2,P,prés,,,707,4.473566,46.273923
2020-985572,2020-02-21,000001,Vente,99000,5171,,LES PLATIERES,B089,69790,69182,Saint-Bonnet-des-Bruyères,69,,,69182000AC0365,,,,,,,,,,,,,0,1,Maison,70,2,S,sols,,,927,4.473566,46.273923
2020-985696,2020-03-04,000001,Vente,180,,,PETAY,B081,69790,69182,Saint-Bonnet-des-Bruyères,69,,,691820000C0163,,,,,,,,,,,,,0,,,,,BT,taillis simples,,,1500,4.499037,46.272226
2020-985733,2020-03-02,000001,Vente,25000,5018,,LE BOURG,B008,69790,69182,Saint-Bonnet-des-Bruyères,69,,,69182000AB0071,,,,,,,,,,,,,0,1,Maison,79,3,S,sols,,,227,4.470521,46.270561
2020-985787,2020-03-17,000001,Vente,74015,5199,,LES GRANDES ROCHES,B062,69790,69182,Saint-Bonnet-des-Bruyères,69,,,691820000A0467,,,,,,,,,,,,,0,1,Maison,70,1,S,sols,,,525,4.464979,46.289225
2020-985787,2020-03-17,000001,Vente,74015,5199,,LES GRANDES ROCHES,B062,69790,69182,Saint-Bonnet-des-Bruyères,69,,,691820000A0467,,,,,,,,,,,,,0,1,Maison,70,1,BT,taillis simples,,,3581,4.464979,46.289225
2020-985787,2020-03-17,000001,Vente,74015,5199,,LES GRANDES ROCHES,B062,69790,69182,Saint-Bonnet-des-Bruyères,69,,,691820000A0467,,,,,,,,,,,,,0,1,Maison,70,1,T,terres,,,1249,4.464979,46.289225
2020-986197,2020-05-12,000001,Vente,30000,5150,,FLACELIERE,B048,69790,69182,Saint-Bonnet-des-Bruyères,69,,,69182000AE0101,,,,,,,,,,,,,0,1,Maison,114,5,S,sols,,,1055,4.488428,46.274123
2020-986197,2020-05-12,000001,Vente,30000,5150,,FLACELIERE,B048,69790,69182,Saint-Bonnet-des-Bruyères,69,,,69182000AE0101,,,,,,,,,,,,,0,1,Maison,36,1,S,sols,,,1055,4.488428,46.274123
2020-986616,2020-06-03,000001,Vente,100,,,CHATELVAY,B029,69790,69182,Saint-Bonnet-des-Bruyères,69,,,69182000AC0033,,,,,,,,,,,,,0,,,,,BR,futaies résineuses,,,787,4.470948,46.282122
2020-986690,2020-06-02,000001,Vente,2100,,,CHARMUET,B024,69790,69182,Saint-Bonnet-des-Bruyères,69,,,69182000AK0055,,,,,,,,,,,,,0,,,,,BR,futaies résineuses,,,1806,4.474112,46.245573
2020-986775,2020-05-28,000001,Vente,1650,,,LES BROSSES,B009,69790,69182,Saint-Bonnet-des-Bruyères,69,,,69182000AM0126,,,,,,,,,,,,,0,,,,,BT,taillis simples,,,4140,4.451583,46.264221
2020-986775,2020-05-28,000001,Vente,1650,,,LES BROSSES,B009,69790,69182,Saint-Bonnet-des-Bruyères,69,,,69182000AM0126,,,,,,,,,,,,,0,,,,,PA,pâtures,,,3865,4.451583,46.264221
2020-986903,2020-06-16,000001,Vente,3550,,,CHATELVAY,B029,69790,69182,Saint-Bonnet-des-Bruyères,69,,,69182000AC0055,,,,,,,,,,,,,0,,,,,BT,taillis simples,,,6813,4.476169,46.281793
2020-986903,2020-06-16,000001,Vente,3550,,,VAJOUDRIX,B118,69790,69182,Saint-Bonnet-des-Bruyères,69,,,69182000AC0066,,,,,,,,,,,,,0,,,,,BT,taillis simples,,,3240,4.475157,46.283197
2020-986903,2020-06-16,000001,Vente,3550,,,LES PLATIERES,B089,69790,69182,Saint-Bonnet-des-Bruyères,69,,,69182000AC0105,,,,,,,,,,,,,0,,,,,BR,futaies résineuses,,,2274,4.475039,46.276756
2020-986972,2020-06-11,000001,Vente,100000,5112,,VILLEMARTIN,B125,69790,69182,Saint-Bonnet-des-Bruyères,69,,,69182000AI0085,,,,,,,,,,,,,0,1,Maison,110,4,S,sols,,,1200,4.476253,46.253475
2020-986972,2020-06-11,000001,Vente,100000,5112,,VILLEMARTIN,B125,69790,69182,Saint-Bonnet-des-Bruyères,69,,,69182000AI0085,,,,,,,,,,,,,0,1,Maison,110,4,P,prés,,,2975,4.476253,46.253475
2020-987724,2020-08-03,000001,Vente,64000,5175,,LA NATION,B078,69790,69182,Saint-Bonnet-des-Bruyères,69,,,69182000AC0013,,,,,,,,,,,,,0,1,Maison,108,5,S,sols,,,651,4.469597,46.283758
2020-987724,2020-08-03,000001,Vente,64000,5175,,LA NATION,B078,69790,69182,Saint-Bonnet-des-Bruyères,69,,,69182000AC0013,,,,,,,,,,,,,0,1,Maison,108,5,P,prés,,,7760,4.469597,46.283758
2020-987724,2020-08-03,000001,Vente,64000,5175,,LA NATION,B078,69790,69182,Saint-Bonnet-des-Bruyères,69,,,69182000AC0013,,,,,,,,,,,,,0,1,Maison,108,5,J,jardins,,,982,4.469597,46.283758
2020-987724,2020-08-03,000001,Vente,64000,,,LA NATION,B078,69790,69182,Saint-Bonnet-des-Bruyères,69,,,69182000AC0254,,,,,,,,,,,,,0,,,,,S,sols,,,205,4.468093,46.282966
2020-987724,2020-08-03,000001,Vente,64000,,,LA NATION,B078,69790,69182,Saint-Bonnet-des-Bruyères,69,,,69182000AC0255,,,,,,,,,,,,,0,,,,,T,terres,,,6465,4.468755,46.283604
2020-987911,2020-08-28,000001,Vente,2500,,,LES PIESSETTES,B085,69790,69182,Saint-Bonnet-des-Bruyères,69,,,69182000AL0012,,,,,,,,,,,,,0,,,,,BR,futaies résineuses,,,8700,4.450143,46.257277
2020-987911,2020-08-28,000001,Vente,2500,,,LES CHETIFS BOIS,B033,69790,69182,Saint-Bonnet-des-Bruyères,69,,,69182000AL0072,,,,,,,,,,,,,0,,,,,BR,futaies résineuses,,,1850,4.454138,46.257075
2020-988318,2020-10-05,000001,Vente,100000,5160,,GANIVET,B055,69790,69182,Saint-Bonnet-des-Bruyères,69,,,69182000AE0305,,,,,,,,,,,,,0,1,Maison,97,4,S,sols,,,386,4.473952,46.273998
2020-988603,2020-10-12,000001,Vente,3000,,,LES BRUYERES EST,B011,69790,69182,Saint-Bonnet-des-Bruyères,69,,,69182000AM0043,,,,,,,,,,,,,0,,,,,T,terres,,,3815,4.456523,46.264483
2020-988603,2020-10-12,000001,Vente,3000,,,LES BRUYERES EST,B011,69790,69182,Saint-Bonnet-des-Bruyères,69,,,69182000AM0043,,,,,,,,,,,,,0,,,,,S,sols,,,45,4.456523,46.264483
2020-988884,2020-10-15,000001,Vente,500,,,LES MOSSIERES,B075,69790,69182,Saint-Bonnet-des-Bruyères,69,,,69182000AI0176,,,,,,,,,,,,,0,,,,,BR,futaies résineuses,,,1123,4.468458,46.257941
2020-989207,2020-11-10,000001,Vente,1773.75,,,PIERRE ROCHE,B084,69790,69182,Saint-Bonnet-des-Bruyères,69,,,691820000C0240,,,,,,,,,,,,,0,,,,,BT,taillis simples,,,6640,4.502575,46.258488
2020-989207,2020-11-10,000001,Vente,1773.75,,,PIERRE ROCHE,B084,69790,69182,Saint-Bonnet-des-Bruyères,69,,,691820000C0255,,,,,,,,,,,,,0,,,,,BT,taillis simples,,,7550,4.499665,46.259413
2020-989400,2020-12-02,000001,Vente,65000,5047,,FROMONTO,B053,69790,69182,Saint-Bonnet-des-Bruyères,69,,,69182000AB0029,,,,,,,,,,,,,0,1,Maison,81,2,J,jardins,,,1061,4.463979,46.276237
2020-989400,2020-12-02,000001,Vente,65000,5047,,FROMONTO,B053,69790,69182,Saint-Bonnet-des-Bruyères,69,,,69182000AB0029,,,,,,,,,,,,,0,1,Maison,81,2,S,sols,,,435,4.463979,46.276237
2020-989493,2020-12-02,000001,Vente,32500,5152,,FLACELIERE,B048,69790,69182,Saint-Bonnet-des-Bruyères,69,,,69182000AE0115,,,,,,,,,,,,,0,1,Maison,54,2,S,sols,,,1030,4.487862,46.27356
2020-989493,2020-12-02,000001,Vente,32500,,,FLACELIERE,B048,69790,69182,Saint-Bonnet-des-Bruyères,69,,,69182000AE0116,,,,,,,,,,,,,0,,,,,J,jardins,,,99,4.488108,46.273369
2020-989598,2020-12-12,000001,Vente,500,,,LES BROSSES,B009,69790,69182,Saint-Bonnet-des-Bruyères,69,,,69182000AM0127,,,,,,,,,,,,,0,,,,,BT,taillis simples,,,1363,4.452322,46.263843
2020-989598,2020-12-12,000001,Vente,500,,,LES BROSSES,B009,69790,69182,Saint-Bonnet-des-Bruyères,69,,,69182000AM0128,,,,,,,,,,,,,0,,,,,BT,taillis simples,,,1122,4.452456,46.263568
2020-989998,2020-12-22,000001,Vente,48000,5142,,MUSSERY,B077,69790,69182,Saint-Bonnet-des-Bruyères,69,,,691820000C0024,,,,,,,,,,,,,0,1,Maison,49,2,S,sols,,,198,4.492286,46.262865
2020-990000,2020-12-18,000002,Vente,37700,5154,,FLACELIERE,B048,69790,69182,Saint-Bonnet-des-Bruyères,69,,,69182000AE0512,,,,,,,,,,,,,0,1,Maison,75,3,,,,,,4.488482,46.273367
