id_mutation,date_mutation,numero_disposition,nature_mutation,valeur_fonciere,adresse_numero,adresse_suffixe,adresse_nom_voie,adresse_code_voie,code_postal,code_commune,nom_commune,code_departement,ancien_code_commune,ancien_nom_commune,id_parcelle,ancien_id_parcelle,numero_volume,lot1_numero,lot1_surface_carrez,lot2_numero,lot2_surface_carrez,lot3_numero,lot3_surface_carrez,lot4_numero,lot4_surface_carrez,lot5_numero,lot5_surface_carrez,nombre_lots,code_type_local,type_local,surface_reelle_bati,nombre_pieces_principales,code_nature_culture,nature_culture,code_nature_culture_speciale,nature_culture_speciale,surface_terrain,longitude,latitude
2020-985022,2020-01-08,000001,Vente,205005,3,,ALL DE L AVENIR,0080,69170,69243,Tarare,69,,,69243000AS0107,,,,,,,,,,,,,0,1,Maison,74,5,S,sols,,,440,4.440427,45.886829
2020-985024,2020-01-15,000001,Vente,10000,1,,BD VOLTAIRE,1520,69170,69243,Tarare,69,,,69243000AV0025,,,4,,,,,,,,,,1,3,Dépendance,,0,,,,,,4.432728,45.894965
2020-985025,2020-01-15,000001,Vente,115000,4,,RUE DE SAVOIE,1300,69170,69243,Tarare,69,,,69243000AV0324,,,14,,,,,,,,,,1,2,Appartement,63,3,,,,,,4.432603,45.894889
2020-985119,2020-01-08,000001,Vente,157000,15,,RUE DUBREUIL,0490,69170,69243,Tarare,69,,,69243000AZ0497,,,1,83.05,,,,,,,,,1,2,Appartement,83,3,,,,,,4.43026,45.896761
2020-985122,2020-01-08,000001,Vente,123750,2,,BD COMMANDANT THIVEL,0400,69170,69243,Tarare,69,,,69243000AM0116,,,21,77.61,,,,,,,,,1,2,Appartement,80,4,,,,,,4.43975,45.894282
2020-985133,2020-01-13,000001,Vente,149900,16,,RUE SERROUX,1320,69170,69243,Tarare,69,,,69243000AZ0326,,,,,,,,,,,,,0,2,Appartement,106,5,S,sols,,,98,4.427276,45.895953
2020-985133,2020-01-13,000001,Vente,149900,16,,RUE SERROUX,1320,69170,69243,Tarare,69,,,69243000AZ0326,,,,,,,,,,,,,0,2,Appartement,45,3,S,sols,,,98,4.427276,45.895953
2020-985136,2020-01-10,000001,Vente,90000,6,,AV EDOUARD HERRIOT,0515,69170,69243,Tarare,69,,,69243000AM0072,,,15,62.52,28,,,,,,,,2,2,Appartement,70,4,,,,,,4.440555,45.893305
2020-985136,2020-01-10,000001,Vente,90000,6,,AV EDOUARD HERRIOT,0515,69170,69243,Tarare,69,,,69243000AM0072,,,1,,,,,,,,,,1,3,Dépendance,,0,,,,,,4.440555,45.893305
2020-985137,2020-01-07,000001,Vente,150000,27,,RUE DE SAVOIE,1300,69170,69243,Tarare,69,,,69243000AV0347,,,1,,,,,,,,,,1,3,Dépendance,,0,,,,,,4.433173,45.894244
2020-985137,2020-01-07,000001,Vente,150000,27,,RUE DE SAVOIE,1300,69170,69243,Tarare,69,,,69243000AV0347,,,6,107,,,,,,,,,1,2,Appartement,92,4,,,,,,4.433173,45.894244
2020-985141,2020-01-10,000001,Vente,246150,69,,RUE DE LA REPUBLIQUE,1230,69170,69243,Tarare,69,,,69243000AC0210,,,15,197.65,31,,5,,,,,,3,2,Appartement,92,3,,,,,,4.434348,45.895231
2020-985141,2020-01-10,000001,Vente,246150,69,,RUE DE LA REPUBLIQUE,1230,69170,69243,Tarare,69,,,69243000AC0210,,,16,197.65,2,,32,,37,,,,4,2,Appartement,122,3,,,,,,4.434348,45.895231
2020-985172,2020-01-10,000001,Vente,225000,32,,RUE JEAN MOULIN,0770,69170,69243,Tarare,69,,,69243000AE0030,,,,,,,,,,,,,0,1,Maison,94,4,S,sols,,,810,4.439914,45.899956
2020-985229,2020-01-22,000001,Vente,103900,22,,AV EDOUARD HERRIOT,0515,69170,69243,Tarare,69,,,69243000AM0035,,,3,82.59,,,,,,,,,1,2,Appartement,83,4,,,,,,4.442034,45.892479
2020-985282,2020-01-17,000001,Vente en l'état futur d'achèvement,248000,,,RUE GAMBETTA,0590,69170,69243,Tarare,69,,,69243000AD0132,,,10,,,,,,,,,,1,3,Dépendance,,0,,,,,,4.436192,45.89464
2020-985282,2020-01-17,000001,Vente en l'état futur d'achèvement,248000,,,RUE GAMBETTA,0590,69170,69243,Tarare,69,,,69243000AD0132,,,8,,,,,,,,,,1,2,Appartement,77,3,,,,,,4.436192,45.89464
2020-985284,2020-01-17,000001,Vente en l'état futur d'achèvement,235000,,,RUE GAMBETTA,0590,69170,69243,Tarare,69,,,69243000AD0132,,,5,,,,,,,,,,1,2,Appartement,71,3,,,,,,4.436192,45.89464
2020-985284,2020-01-17,000001,Vente en l'état futur d'achèvement,235000,,,RUE GAMBETTA,0590,69170,69243,Tarare,69,,,69243000AD0132,,,12,,,,,,,,,,1,3,Dépendance,,0,,,,,,4.436192,45.89464
2020-985285,2020-01-17,000001,Vente en l'état futur d'achèvement,240500,,,RUE GAMBETTA,0590,69170,69243,Tarare,69,,,69243000AD0132,,,14,,,,,,,,,,1,3,Dépendance,,0,,,,,,4.436192,45.89464
2020-985285,2020-01-17,000001,Vente en l'état futur d'achèvement,240500,,,RUE GAMBETTA,0590,69170,69243,Tarare,69,,,69243000AD0132,,,6,,,,,,,,,,1,2,Appartement,77,3,,,,,,4.436192,45.89464
2020-985290,2020-02-13,000001,Vente,70000,2,,RUE EMILE ZOLA,0520,69170,69243,Tarare,69,,,69243000AC0051,,,10,,18,69.39,7,,8,,9,,5,2,Appartement,69,3,,,,,,4.433053,45.895703
2020-985321,2020-01-30,000001,Vente en l'état futur d'achèvement,122000,,,RUE GAMBETTA,0590,69170,69243,Tarare,69,,,69243000AD0132,,,2,,,,,,,,,,1,2,Appartement,42,2,,,,,,4.436192,45.89464
2020-985321,2020-01-30,000001,Vente en l'état futur d'achèvement,122000,,,RUE GAMBETTA,0590,69170,69243,Tarare,69,,,69243000AD0132,,,9,,,,,,,,,,1,3,Dépendance,,0,,,,,,4.436192,45.89464
2020-985326,2020-01-23,000001,Vente en l'état futur d'achèvement,243800,,,RUE GAMBETTA,0590,69170,69243,Tarare,69,,,69243000AD0132,,,13,,,,,,,,,,1,3,Dépendance,,0,,,,,,4.436192,45.89464
2020-985326,2020-01-23,000001,Vente en l'état futur d'achèvement,243800,,,RUE GAMBETTA,0590,69170,69243,Tarare,69,,,69243000AD0132,,,7,,,,,,,,,,1,2,Appartement,71,3,,,,,,4.436192,45.89464
2020-985334,2020-02-07,000001,Vente,164000,5,,RUE EMILE ZOLA,0520,69170,69243,Tarare,69,,,69243000AC0074,,,1,,5,116.95,,,,,,,2,2,Appartement,117,4,,,,,,4.433388,45.895835
2020-985341,2020-01-24,000001,Vente,16000,15,,RUE DES AYETS,0100,69170,69243,Tarare,69,,,69243000AH0159,,,,,,,,,,,,,0,3,Dépendance,,0,S,sols,,,112,4.430816,45.898386
2020-985341,2020-01-24,000001,Vente,16000,15,,RUE DES AYETS,0100,69170,69243,Tarare,69,,,69243000AH0159,,,,,,,,,,,,,0,3,Dépendance,,0,S,sols,,,112,4.430816,45.898386
2020-985375,2020-02-14,000001,Vente,65000,6,,RUE NICOLAS SEVE,0980,69170,69243,Tarare,69,,,69243000AB0140,,,101,,102,81.82,115,,,,,,3,4,Local industriel. commercial ou assimilé,80,0,,,,,,4.435632,45.897326
2020-985415,2020-01-31,000001,Vente,300,18,,BD LAMARTINE,0820,69170,69243,Tarare,69,,,69243000AZ0205,,,27,,,,,,,,,,1,2,Appartement,61,3,,,,,,4.430499,45.895168
2020-985418,2020-02-24,000002,Vente,103500,26,,AV EDOUARD HERRIOT,0515,69170,69243,Tarare,69,,,69243000AM0033,,,,,,,,,,,,,0,,,,,S,sols,,,245,4.442129,45.892365
2020-985431,2020-01-31,000001,Vente,104000,18,,BD LAMARTINE,0820,69170,69243,Tarare,69,,,69243000AZ0205,,,2,,,,,,,,,,1,2,Appartement,81,3,,,,,,4.430499,45.895168
2020-985448,2020-01-27,000001,Vente,28000,3,,PL VICTOR HUGO,1480,69170,69243,Tarare,69,,,69243000AB0251,,,1,50.75,,,,,,,,,1,4,Local industriel. commercial ou assimilé,48,0,,,,,,4.434328,45.898268
2020-985533,2020-02-19,000001,Vente,37000,4,,RUE BARONNAT,0110,69170,69243,Tarare,69,,,69243000AH0136,,,,,,,,,,,,,0,4,Local industriel. commercial ou assimilé,130,0,S,sols,,,177,4.433345,45.899197
2020-985587,2020-02-14,000001,Vente,1.2,23,,RUE DE PARIS,1000,69170,69243,Tarare,69,,,69243000AY0164,,,,,,,,,,,,,0,4,Local industriel. commercial ou assimilé,1129,0,S,sols,,,3758,4.423626,45.895081
2020-985654,2020-02-27,000002,Vente,210000,4,,CHE DE LA PROVIDENCE,1199,69170,69243,Tarare,69,,,69243000AZ0574,,,,,,,,,,,,,0,1,Maison,184,7,,,,,,4.425242,45.898163
2020-985667,2020-02-14,000001,Vente,94000,22,,BD LAMARTINE,0820,69170,69243,Tarare,69,,,69243000AZ0199,,,50,,,,,,,,,,1,3,Dépendance,,0,,,,,,4.430896,45.895166
2020-985667,2020-02-14,000001,Vente,94000,22,,BD LAMARTINE,0820,69170,69243,Tarare,69,,,69243000AZ0199,,,34,84.89,4,,,,,,,,2,2,Appartement,85,4,,,,,,4.430896,45.895166
2020-985709,2020-02-28,000001,Vente,313000,158,,CHE DES LUCIOLES,0841,69170,69243,Tarare,69,,,69243000AH0450,,,,,,,,,,,,,0,1,Maison,144,8,S,sols,,,821,4.433478,45.902455
2020-985709,2020-02-28,000001,Vente,313000,,,CHE DE CAMPY,0240,69170,69243,Tarare,69,,,69243000AH0451,,,,,,,,,,,,,0,,,,,S,sols,,,106,4.433275,45.902418
2020-985714,2020-02-21,000001,Vente,220000,23,,RUE CDT ETIENNE LAFAY,0805,69170,69243,Tarare,69,,,69243000AW0093,,,,,,,,,,,,,0,1,Maison,110,5,S,sols,,,992,4.433136,45.889836
2020-985731,2020-02-26,000001,Vente,7500,17,B,RUE DUBREUIL,0490,69170,69243,Tarare,69,,,69243000AZ0422,,,6,,,,,,,,,,1,3,Dépendance,,0,,,,,,4.430277,45.896965
2020-985737,2020-02-28,000001,Vente,349300,1,,RUE VAUZELLE,1430,69170,69243,Tarare,69,,,69243000AM0116,,,1,,27,224.45,,,,,,,2,2,Appartement,232,5,,,,,,4.43975,45.894282
2020-985766,2020-02-25,000001,Vente,71089,38,,RUE JEAN MONNET,0768,69170,69243,Tarare,69,,,69243000AP0244,,,12,,41,,70,,,,,,3,1,Maison,64,3,,,,,,4.447026,45.891112
2020-985792,2020-02-28,000001,Vente,351000,7,,RUE DE VERDUN,1450,69170,69243,Tarare,69,,,69243000AV0082,,,,,,,,,,,,,0,1,Maison,260,7,J,jardins,POTAG,Jardin potager,405,4.43716,45.892047
2020-985792,2020-02-28,000001,Vente,351000,7,,RUE DE VERDUN,1450,69170,69243,Tarare,69,,,69243000AV0082,,,,,,,,,,,,,0,1,Maison,260,7,S,sols,,,773,4.43716,45.892047
2020-985795,2020-02-21,000001,Vente,71000,33,,RUE RADISSON,1210,69170,69243,Tarare,69,,,69243000AE0165,,,4,,9,60,,,,,,,2,2,Appartement,62,3,,,,,,4.436925,45.896812
2020-985796,2020-03-11,000001,Vente,160000,9002,,RTE DE FEURS,0570,69170,69243,Tarare,69,,,69243000AV0117,,,,,,,,,,,,,0,1,Maison,60,2,S,sols,,,560,4.433095,45.893769
2020-985808,2020-02-28,000001,Vente,9000,3,,RUE DOC GUFFON,0480,69170,69243,Tarare,69,,,69243000AB0181,,,34,,,,,,,,,,1,3,Dépendance,,0,,,,,,4.43422,45.898657
2020-985814,2020-03-11,000001,Vente,696000,23,,RUE DE PARIS,1000,69170,69243,Tarare,69,,,69243000AY0164,,,,,,,,,,,,,0,4,Local industriel. commercial ou assimilé,1129,0,S,sols,,,3758,4.423626,45.895081
2020-985833,2020-03-03,000001,Vente,210000,56,,RUE DE SAVOIE,1300,69170,69243,Tarare,69,,,69243000AV0219,,,,,,,,,,,,,0,2,Appartement,80,6,S,sols,,,519,4.43524,45.893583
2020-985833,2020-03-03,000001,Vente,210000,56,,RUE DE SAVOIE,1300,69170,69243,Tarare,69,,,69243000AV0219,,,,,,,,,,,,,0,2,Appartement,70,3,S,sols,,,519,4.43524,45.893583
2020-985833,2020-03-03,000001,Vente,210000,56,,RUE DE SAVOIE,1300,69170,69243,Tarare,69,,,69243000AV0219,,,,,,,,,,,,,0,2,Appartement,70,3,S,sols,,,519,4.43524,45.893583
2020-985833,2020-03-03,000001,Vente,210000,56,,RUE DE SAVOIE,1300,69170,69243,Tarare,69,,,69243000AV0219,,,,,,,,,,,,,0,2,Appartement,70,3,S,sols,,,519,4.43524,45.893583
2020-985852,2020-03-17,000001,Vente,120000,18,,RUE DOC GUFFON,0480,69170,69243,Tarare,69,,,69243000AE0332,,,31,55.26,88,,,,,,,,2,2,Appartement,55,3,,,,,,4.435672,45.898581
2020-985894,2020-03-13,000001,Vente,160000,42,,RUE DES AYETS,0100,69170,69243,Tarare,69,,,69243000AH0188,,,,,,,,,,,,,0,1,Maison,140,4,S,sols,,,155,4.43025,45.900366
2020-985894,2020-03-13,000001,Vente,160000,42,,RUE DES AYETS,0100,69170,69243,Tarare,69,,,69243000AH0282,,,,,,,,,,,,,0,,,,,S,sols,,,54,4.430313,45.900266
2020-985904,2020-03-04,000001,Vente,108000,14,,CHE DE BELLEVUE,0179,69170,69243,Tarare,69,,,69243000AH0534,,,,,,,,,,,,,0,1,Maison,70,2,S,sols,,,398,4.429691,45.900865
2020-985904,2020-03-04,000001,Vente,108000,14,,CHE DE BELLEVUE,0179,69170,69243,Tarare,69,,,69243000AH0534,,,,,,,,,,,,,0,3,Dépendance,,0,S,sols,,,398,4.429691,45.900865
2020-985906,2020-03-11,000001,Vente,76100,18,,AV EDOUARD HERRIOT,0515,69170,69243,Tarare,69,,,69243000AM0037,,,35,59.8,,,,,,,,,1,2,Appartement,60,3,,,,,,4.44189,45.892565
2020-985938,2020-03-13,000001,Vente,50000,18,,RUE ETIENNE DOLET,0530,69170,69243,Tarare,69,,,69243000AD0112,,,25,,,,,,,,,,1,2,Appartement,1,0,,,,,,4.43761,45.895105
2020-985938,2020-03-13,000001,Vente,50000,18,,RUE ETIENNE DOLET,0530,69170,69243,Tarare,69,,,69243000AD0112,,,26,49.94,31,,37,,4,,,,4,2,Appartement,54,2,,,,,,4.43761,45.895105
2020-985944,2020-03-05,000001,Vente en l'état futur d'achèvement,225200,10,,RUE GAMBETTA,0590,69170,69243,Tarare,69,,,69243000AD0132,,,15,,,,,,,,,,1,3,Dépendance,,0,,,,,,4.436192,45.89464
2020-985944,2020-03-05,000001,Vente en l'état futur d'achèvement,225200,10,,RUE GAMBETTA,0590,69170,69243,Tarare,69,,,69243000AD0132,,,4,,,,,,,,,,1,2,Appartement,77,3,,,,,,4.436192,45.89464
2020-985960,2020-04-02,000001,Vente,179000,11,,CHE D AUXERRE,0060,69170,69243,Tarare,69,,,69243000AY0043,,,,,,,,,,,,,0,1,Maison,81,5,S,sols,,,972,4.421748,45.895119
2020-985979,2020-03-12,000002,Vente,49500,31,,RUE DE LA REPUBLIQUE,1230,69170,69243,Tarare,69,,,69243000AZ0193,,,7,,,,,,,,,,1,2,Appartement,48,3,,,,,,4.432026,45.895388
2020-985983,2020-01-08,000001,Vente,165000,19,,RUE SERROUX,1320,69170,69243,Tarare,69,,,69243000AZ0222,,,,,,,,,,,,,0,2,Appartement,102,3,S,sols,,,142,4.427151,45.895659
2020-985983,2020-01-08,000001,Vente,165000,19,,RUE SERROUX,1320,69170,69243,Tarare,69,,,69243000AZ0222,,,,,,,,,,,,,0,2,Appartement,102,3,S,sols,,,142,4.427151,45.895659
2020-985983,2020-01-08,000001,Vente,165000,19,,RUE SERROUX,1320,69170,69243,Tarare,69,,,69243000AZ0222,,,,,,,,,,,,,0,2,Appartement,102,3,S,sols,,,142,4.427151,45.895659
2020-985983,2020-01-08,000001,Vente,165000,19,,RUE SERROUX,1320,69170,69243,Tarare,69,,,69243000AZ0222,,,,,,,,,,,,,0,3,Dépendance,,0,S,sols,,,142,4.427151,45.895659
2020-985984,2020-04-14,000001,Vente,266500,23,,RUE JEAN MOULIN,0770,69170,69243,Tarare,69,,,69243000AE0023,,,,,,,,,,,,,0,1,Maison,168,6,S,sols,,,1774,4.43963,45.900391
2020-985999,2020-04-17,000001,Vente,283500,6,,RUE GIRERD,0650,69170,69243,Tarare,69,,,69243000AE0175,,,,,,,,,,,,,0,2,Appartement,60,3,S,sols,,,128,4.437267,45.896584
2020-985999,2020-04-17,000001,Vente,283500,6,,RUE GIRERD,0650,69170,69243,Tarare,69,,,69243000AE0175,,,,,,,,,,,,,0,2,Appartement,60,3,S,sols,,,128,4.437267,45.896584
2020-985999,2020-04-17,000001,Vente,283500,6,,RUE GIRERD,0650,69170,69243,Tarare,69,,,69243000AE0175,,,,,,,,,,,,,0,2,Appartement,60,2,S,sols,,,128,4.437267,45.896584
2020-985999,2020-04-17,000001,Vente,283500,6,,RUE GIRERD,0650,69170,69243,Tarare,69,,,69243000AE0175,,,,,,,,,,,,,0,2,Appartement,60,3,S,sols,,,128,4.437267,45.896584
2020-985999,2020-04-17,000001,Vente,283500,6,,RUE GIRERD,0650,69170,69243,Tarare,69,,,69243000AE0175,,,,,,,,,,,,,0,2,Appartement,95,5,S,sols,,,128,4.437267,45.896584
2020-986007,2020-04-16,000001,Vente,87453,1,,RUE GAMBETTA,0590,69170,69243,Tarare,69,,,69243000AD0137,,,17,79,,,,,,,,,1,2,Appartement,78,4,,,,,,4.435587,45.894292
2020-986053,2020-04-30,000001,Vente,110000,27,,RUE RADISSON,1210,69170,69243,Tarare,69,,,69243000AE0197,,,,,,,,,,,,,0,2,Appartement,56,3,S,sols,,,119,4.436187,45.897125
2020-986053,2020-04-30,000001,Vente,110000,27,,RUE RADISSON,1210,69170,69243,Tarare,69,,,69243000AE0197,,,,,,,,,,,,,0,2,Appartement,73,3,S,sols,,,119,4.436187,45.897125
2020-986066,2020-04-28,000001,Vente,155000,30,,AV CHARLES DE GAULLE,0345,69170,69243,Tarare,69,,,69243000AB0247,,,10,,14,,5,,9,,,,4,2,Appartement,75,3,,,,,,4.43345,45.897885
2020-986066,2020-04-28,000001,Vente,155000,30,,AV CHARLES DE GAULLE,0345,69170,69243,Tarare,69,,,69243000AB0247,,,10,,11,,12,,13,,15,,7,4,Local industriel. commercial ou assimilé,4600,0,,,,,,4.43345,45.897885
2020-986066,2020-04-28,000001,Vente,155000,5,,AV DES BELGES,0170,69170,69243,Tarare,69,,,69243000AS0224,,,,,,,,,,,,,0,4,Local industriel. commercial ou assimilé,5210,0,S,sols,,,2984,4.438271,45.890877
2020-986077,2020-04-23,000001,Vente,158000,17,,RUE DE LA REPUBLIQUE,1230,69170,69243,Tarare,69,,,69243000AZ0200,,,14,106.03,7,,,,,,,,2,2,Appartement,107,4,,,,,,4.431009,45.895317
2020-986079,2020-04-29,000001,Vente,155000,1,,RUE DU GONNET,0670,69170,69243,Tarare,69,,,69243000AH0060,,,,,,,,,,,,,0,1,Maison,71,4,S,sols,,,358,,
2020-986081,2020-04-23,000001,Vente,156000,6,,RUE DENAVE,0470,69170,69243,Tarare,69,,,69243000AC0113,,,35,,,,,,,,,,1,3,Dépendance,,0,,,,,,4.435418,45.896217
2020-986081,2020-04-23,000001,Vente,156000,6,,RUE DENAVE,0470,69170,69243,Tarare,69,,,69243000AC0113,,,15,166.05,31,,32,,4,,,,4,2,Appartement,160,5,,,,,,4.435418,45.896217
2020-986095,2020-05-07,000001,Vente,70000,2,,BD COMMANDANT THIVEL,0400,69170,69243,Tarare,69,,,69243000AM0116,,,20,,6,,,,,,,,2,4,Local industriel. commercial ou assimilé,204,0,,,,,,4.43975,45.894282
2020-986095,2020-05-07,000001,Vente,70000,2,,BD COMMANDANT THIVEL,0400,69170,69243,Tarare,69,,,69243000AM0116,,,19,,2,,,,,,,,2,4,Local industriel. commercial ou assimilé,202,0,,,,,,4.43975,45.894282
2020-986111,2020-03-12,000001,Vente,171000,22,,RUE DE LA PREVOYANCE,1190,69170,69243,Tarare,69,,,69243000AS0141,,,,,,,,,,,,,0,1,Maison,74,4,S,sols,,,398,4.439392,45.886689
2020-986123,2020-05-07,000001,Vente,4000,18,,RUE DOC GUFFON,0480,69170,69243,Tarare,69,,,69243000AE0332,,,64,,,,,,,,,,1,3,Dépendance,,0,,,,,,4.435672,45.898581
2020-986125,2020-04-30,000001,Vente,115000,5,,RUE EMILE ZOLA,0520,69170,69243,Tarare,69,,,69243000AC0074,,,3,,,,,,,,,,1,2,Appartement,64,3,,,,,,4.433388,45.895835
2020-986125,2020-04-30,000001,Vente,115000,5,,RUE EMILE ZOLA,0520,69170,69243,Tarare,69,,,69243000AC0074,,,2,,,,,,,,,,1,2,Appartement,47,2,,,,,,4.433388,45.895835
2020-986126,2020-04-28,000001,Vente,86000,18,,AV CHARLES DE GAULLE,0345,69170,69243,Tarare,69,,,69243000AB0096,,,5,55.62,,,,,,,,,1,2,Appartement,98,2,,,,,,4.433374,45.897422
2020-986128,2020-05-13,000001,Vente,81000,18,,AV CHARLES DE GAULLE,0345,69170,69243,Tarare,69,,,69243000AB0096,,,3,55.78,7,,,,,,,,2,2,Appartement,55,3,,,,,,4.433374,45.897422
2020-986129,2020-04-28,000001,Vente,236500,41,,RUE BARONNAT,0110,69170,69243,Tarare,69,,,69243000AH0292,,,11,,12,,13,,2,,8,,5,2,Appartement,109,4,,,,,,4.43254,45.902033
2020-986129,2020-04-28,000001,Vente,236500,41,,RUE BARONNAT,0110,69170,69243,Tarare,69,,,69243000AH0292,,,6,,,,,,,,,,1,3,Dépendance,,0,,,,,,4.43254,45.902033
2020-986129,2020-04-28,000001,Vente,236500,41,,RUE BARONNAT,0110,69170,69243,Tarare,69,,,69243000AH0292,,,5,,,,,,,,,,1,3,Dépendance,,0,,,,,,4.43254,45.902033
2020-986144,2020-05-12,000001,Vente,71680,1,,RUE GAMBETTA,0590,69170,69243,Tarare,69,,,69243000AD0137,,,2,64,,,,,,,,,1,2,Appartement,65,3,,,,,,4.435587,45.894292
2020-986209,2020-05-18,000001,Vente,218700,57,,RUE DE SAVOIE,1300,69170,69243,Tarare,69,,,69243000AV0097,,,7,12.5,,,,,,,,,1,3,Dépendance,,0,,,,,,4.435234,45.892843
2020-986209,2020-05-18,000001,Vente,218700,57,,RUE DE SAVOIE,1300,69170,69243,Tarare,69,,,69243000AV0097,,,4,141.15,6,141.15,,,,,,,2,2,Appartement,171,6,,,,,,4.435234,45.892843
2020-986215,2020-05-12,000001,Vente,128500,3,,RUE NICOLAS SEVE,0980,69170,69243,Tarare,69,,,69243000AE0189,,,13,57.55,,,,,,,,,1,2,Appartement,61,3,,,,,,4.435846,45.897128
2020-986222,2020-05-14,000001,Vente,373800,43,,RUE DOC GUFFON,0480,69170,69243,Tarare,69,,,69243000AE0337,,,,,,,,,,,,,0,1,Maison,140,6,AG,terrains d'agrément,PARC,Parc,968,4.438919,45.896824
2020-986222,2020-05-14,000001,Vente,373800,43,,RUE DOC GUFFON,0480,69170,69243,Tarare,69,,,69243000AE0337,,,,,,,,,,,,,0,1,Maison,140,6,S,sols,,,800,4.438919,45.896824
2020-986222,2020-05-14,000001,Vente,373800,12,,RUE MONTAGNY,0950,69170,69243,Tarare,69,,,69243000AE0340,,,,,,,,,,,,,0,,,,,J,jardins,POTAG,Jardin potager,4,4.438646,45.896699
2020-986242,2020-05-14,000001,Vente,185000,3,,RUE MONTAGNY,0950,69170,69243,Tarare,69,,,69243000AM0044,,,10,,14,107.69,,,,,,,2,2,Appartement,108,6,,,,,,4.43864,45.895684
2020-986242,2020-05-14,000001,Vente,185000,3,,RUE MONTAGNY,0950,69170,69243,Tarare,69,,,69243000AM0044,,,23,,,,,,,,,,1,3,Dépendance,,0,,,,,,4.43864,45.895684
2020-986249,2020-04-30,000001,Vente,226900,6,,RUE LEDRU ROLLIN,0830,69170,69243,Tarare,69,,,69243000AZ0176,,,4,211.54,,,,,,,,,1,2,Appartement,183,4,,,,,,4.431738,45.896119
2020-986249,2020-04-30,000001,Vente,226900,6,,RUE LEDRU ROLLIN,0830,69170,69243,Tarare,69,,,69243000AZ0176,,,5,,,,,,,,,,1,3,Dépendance,,0,,,,,,4.431738,45.896119
2020-986280,2020-05-19,000001,Vente,188000,17,,RUE PIERRE MARIE FAYE,1110,69170,69243,Tarare,69,,,69243000AZ0179,,,41,175.76,,,,,,,,,1,2,Appartement,180,5,,,,,,4.431418,45.895913
2020-986297,2020-05-11,000001,Vente,109060,26,,RTE DE ST CLEMENT,1290,69170,69243,Tarare,69,,,69243000AH0515,,,14,,15,,,,,,,,2,2,Appartement,66,3,,,,,,4.436289,45.901299
2020-986297,2020-05-11,000001,Vente,109060,26,,RTE DE ST CLEMENT,1290,69170,69243,Tarare,69,,,69243000AH0515,,,6,,,,,,,,,,1,3,Dépendance,,0,,,,,,4.436289,45.901299
2020-986300,2020-05-19,000001,Vente,103000,39,,RUE SERROUX,1320,69170,69243,Tarare,69,,,69243000AZ0215,,,,,,,,,,,,,0,2,Appartement,44,3,S,sols,,,70,4.42816,45.895649
2020-986300,2020-05-19,000001,Vente,103000,39,,RUE SERROUX,1320,69170,69243,Tarare,69,,,69243000AZ0215,,,,,,,,,,,,,0,2,Appartement,34,1,S,sols,,,70,4.42816,45.895649
2020-986300,2020-05-19,000001,Vente,103000,39,,RUE SERROUX,1320,69170,69243,Tarare,69,,,69243000AZ0215,,,,,,,,,,,,,0,2,Appartement,38,1,S,sols,,,70,4.42816,45.895649
2020-986352,2020-05-25,000001,Vente,195000,2,,ALL DE L HACIENDA,0695,69170,69243,Tarare,69,,,69243000AT0145,,,,,,,,,,,,,0,1,Maison,74,4,S,sols,,,602,4.434261,45.884834
2020-986354,2020-05-12,000001,Vente,95000,54,,RUE BARONNAT,0110,69170,69243,Tarare,69,,,69243000AH0301,,,,,,,,,,,,,0,3,Dépendance,,0,S,sols,,,86,4.432394,45.901505
2020-986354,2020-05-12,000001,Vente,95000,54,,RUE BARONNAT,0110,69170,69243,Tarare,69,,,69243000AH0301,,,,,,,,,,,,,0,2,Appartement,40,2,S,sols,,,86,4.432394,45.901505
2020-986354,2020-05-12,000001,Vente,95000,54,,RUE BARONNAT,0110,69170,69243,Tarare,69,,,69243000AH0301,,,,,,,,,,,,,0,2,Appartement,40,2,S,sols,,,86,4.432394,45.901505
2020-986461,2020-05-18,000001,Vente en l'état futur d'achèvement,56250,,,RUE GAMBETTA,0590,69170,69243,Tarare,69,,,69243000AD0132,,,1,,,,,,,,,,1,4,Local industriel. commercial ou assimilé,46,0,,,,,,4.436192,45.89464
2020-986543,2020-05-28,000001,Vente,130000,2,,RUE EMILE ZOLA,0520,69170,69243,Tarare,69,,,69243000AC0051,,,15,59.7,,,,,,,,,1,2,Appartement,63,3,,,,,,4.433053,45.895703
2020-986544,2020-05-25,000001,Vente,375000,12,,RUE ANNA BIBERT,0020,69170,69243,Tarare,69,,,69243000AC0088,,,3,,,,,,,,,,1,1,Maison,226,5,,,,,,4.43437,45.895765
2020-986544,2020-05-25,000001,Vente,375000,12,,RUE ANNA BIBERT,0020,69170,69243,Tarare,69,,,69243000AC0088,,,4,,,,,,,,,,1,4,Local industriel. commercial ou assimilé,120,0,,,,,,4.43437,45.895765
2020-986598,2020-05-14,000001,Vente,1155000,18,,RUE EMILE ZOLA,0520,69170,69243,Tarare,69,,,69243000AC0038,,,,,,,,,,,,,0,2,Appartement,168,6,S,sols,,,805,,
2020-986598,2020-05-14,000001,Vente,1155000,18,,RUE EMILE ZOLA,0520,69170,69243,Tarare,69,,,69243000AC0038,,,,,,,,,,,,,0,4,Local industriel. commercial ou assimilé,117,0,S,sols,,,805,,
2020-986598,2020-05-14,000001,Vente,1155000,18,,RUE EMILE ZOLA,0520,69170,69243,Tarare,69,,,69243000AC0038,,,,,,,,,,,,,0,3,Dépendance,,0,S,sols,,,805,,
2020-986598,2020-05-14,000001,Vente,1155000,18,,RUE EMILE ZOLA,0520,69170,69243,Tarare,69,,,69243000AC0038,,,,,,,,,,,,,0,2,Appartement,119,4,S,sols,,,805,,
2020-986598,2020-05-14,000001,Vente,1155000,18,,RUE EMILE ZOLA,0520,69170,69243,Tarare,69,,,69243000AC0038,,,,,,,,,,,,,0,2,Appartement,135,5,S,sols,,,805,,
2020-986598,2020-05-14,000001,Vente,1155000,18,,RUE EMILE ZOLA,0520,69170,69243,Tarare,69,,,69243000AC0038,,,,,,,,,,,,,0,4,Local industriel. commercial ou assimilé,73,0,S,sols,,,805,,
2020-986598,2020-05-14,000001,Vente,1155000,18,,RUE EMILE ZOLA,0520,69170,69243,Tarare,69,,,69243000AC0038,,,,,,,,,,,,,0,3,Dépendance,,0,S,sols,,,805,,
2020-986598,2020-05-14,000001,Vente,1155000,18,,RUE EMILE ZOLA,0520,69170,69243,Tarare,69,,,69243000AC0038,,,,,,,,,,,,,0,3,Dépendance,,0,S,sols,,,805,,
2020-986598,2020-05-14,000001,Vente,1155000,18,,RUE EMILE ZOLA,0520,69170,69243,Tarare,69,,,69243000AC0038,,,,,,,,,,,,,0,3,Dépendance,,0,S,sols,,,805,,
2020-986598,2020-05-14,000001,Vente,1155000,18,,RUE EMILE ZOLA,0520,69170,69243,Tarare,69,,,69243000AC0038,,,,,,,,,,,,,0,2,Appartement,64,3,S,sols,,,805,,
2020-986598,2020-05-14,000001,Vente,1155000,18,,RUE EMILE ZOLA,0520,69170,69243,Tarare,69,,,69243000AC0038,,,,,,,,,,,,,0,2,Appartement,64,3,S,sols,,,805,,
2020-986598,2020-05-14,000001,Vente,1155000,18,,RUE EMILE ZOLA,0520,69170,69243,Tarare,69,,,69243000AC0038,,,,,,,,,,,,,0,2,Appartement,64,3,S,sols,,,805,,
2020-986598,2020-05-14,000001,Vente,1155000,18,,RUE EMILE ZOLA,0520,69170,69243,Tarare,69,,,69243000AC0038,,,,,,,,,,,,,0,4,Local industriel. commercial ou assimilé,250,0,S,sols,,,805,,