id_mutation,date_mutation,numero_disposition,nature_mutation,valeur_fonciere,adresse_numero,adresse_suffixe,adresse_nom_voie,adresse_code_voie,code_postal,code_commune,nom_commune,code_departement,ancien_code_commune,ancien_nom_commune,id_parcelle,ancien_id_parcelle,numero_volume,lot1_numero,lot1_surface_carrez,lot2_numero,lot2_surface_carrez,lot3_numero,lot3_surface_carrez,lot4_numero,lot4_surface_carrez,lot5_numero,lot5_surface_carrez,nombre_lots,code_type_local,type_local,surface_reelle_bati,nombre_pieces_principales,code_nature_culture,nature_culture,code_nature_culture_speciale,nature_culture_speciale,surface_terrain,longitude,latitude
2020-964783,2020-01-13,000001,Vente,413450,1,,RUE GERMINAL,0385,69740,69277,Genas,69,,,69277000AI0222,,,,,,,,,,,,,0,1,Maison,131,5,S,sols,,,602,5.012417,45.739733
2020-965170,2020-01-28,000001,Vente,170000,2,,RUE JEAN REYMOND GABRIEL,0517,69740,69277,Genas,69,,,69277000AI0601,,,1,41.78,,,,,,,,,1,2,Appartement,41,2,,,,,,5.009924,45.73791
2020-965170,2020-01-28,000001,Vente,170000,4,,RUE JEAN REYMOND GABRIEL,0517,69740,69277,Genas,69,,,69277000AI0601,,,26,,,,,,,,,,1,3,Dépendance,,0,,,,,,5.009924,45.73791
2020-965170,2020-01-28,000001,Vente,170000,4,,RUE JEAN REYMOND GABRIEL,0517,69740,69277,Genas,69,,,69277000AI0601,,,25,,,,,,,,,,1,3,Dépendance,,0,,,,,,5.009924,45.73791
2020-965173,2020-01-23,000001,Vente en l'état futur d'achèvement,391000,,,LES GARENNES,B018,69740,69277,Genas,69,,,69277000AL0328,,,51,,,,,,,,,,1,3,Dépendance,,0,,,,,,5.017979,45.744858
2020-965173,2020-01-23,000001,Vente en l'état futur d'achèvement,391000,,,LES GARENNES,B018,69740,69277,Genas,69,,,69277000AL0328,,,18,,,,,,,,,,1,1,Maison,105,5,,,,,,5.017979,45.744858
2020-965229,2020-02-03,000002,Vente,1575,7,,RUE DU REPOS,0800,69740,69277,Genas,69,,,69277000AN0344,,,,,,,,,,,,,0,,,,,S,sols,,,21,5.018161,45.737124
2020-965323,2020-01-14,000001,Vente,1350000,6,,CHE DES MURIERS,0667,69740,69277,Genas,69,,,69277000BE0030,,,,,,,,,,,,,0,4,Local industriel. commercial ou assimilé,,,S,sols,,,3969,4.986578,45.718718
2020-965323,2020-01-14,000001,Vente,1350000,6,,CHE DES MURIERS,0667,69740,69277,Genas,69,,,69277000BE0051,,,,,,,,,,,,,0,,,,,S,sols,,,1455,4.986827,45.719082
2020-965323,2020-01-14,000001,Vente,1350000,4,,CHE DES MURIERS,0667,69740,69277,Genas,69,,,69277000BE0108,,,,,,,,,,,,,0,,,,,S,sols,,,497,4.987222,45.7185
2020-965323,2020-01-14,000001,Vente,1350000,4,,CHE DES MURIERS,0667,69740,69277,Genas,69,,,69277000BE0110,,,,,,,,,,,,,0,,,,,S,sols,,,41,4.987257,45.719004
2020-965383,2020-01-20,000001,Vente en l'état futur d'achèvement,450000,15,,RUE DE L AVENIR,0040,69740,69277,Genas,69,,,69277000BI0048,,,101,,,,,,,,,,1,4,Local industriel. commercial ou assimilé,11,0,,,,,,4.977448,45.718319
2020-965383,2020-01-20,000001,Vente en l'état futur d'achèvement,450000,15,,RUE DE L AVENIR,0040,69740,69277,Genas,69,,,69277000BI0048,,,102,,,,,,,,,,1,4,Local industriel. commercial ou assimilé,11,0,,,,,,4.977448,45.718319
2020-965383,2020-01-20,000001,Vente en l'état futur d'achèvement,450000,15,,RUE DE L AVENIR,0040,69740,69277,Genas,69,,,69277000BI0048,,,15,,,,,,,,,,1,4,Local industriel. commercial ou assimilé,298,0,,,,,,4.977448,45.718319
2020-965383,2020-01-20,000001,Vente en l'état futur d'achèvement,450000,15,,RUE DE L AVENIR,0040,69740,69277,Genas,69,,,69277000BI0048,,,98,,,,,,,,,,1,4,Local industriel. commercial ou assimilé,11,0,,,,,,4.977448,45.718319
2020-965383,2020-01-20,000001,Vente en l'état futur d'achèvement,450000,15,,RUE DE L AVENIR,0040,69740,69277,Genas,69,,,69277000BI0048,,,88,,,,,,,,,,1,4,Local industriel. commercial ou assimilé,10,0,,,,,,4.977448,45.718319
2020-965383,2020-01-20,000001,Vente en l'état futur d'achèvement,450000,15,,RUE DE L AVENIR,0040,69740,69277,Genas,69,,,69277000BI0048,,,87,,,,,,,,,,1,4,Local industriel. commercial ou assimilé,10,0,,,,,,4.977448,45.718319
2020-965383,2020-01-20,000001,Vente en l'état futur d'achèvement,450000,15,,RUE DE L AVENIR,0040,69740,69277,Genas,69,,,69277000BI0048,,,89,,,,,,,,,,1,4,Local industriel. commercial ou assimilé,11,0,,,,,,4.977448,45.718319
2020-965383,2020-01-20,000001,Vente en l'état futur d'achèvement,450000,15,,RUE DE L AVENIR,0040,69740,69277,Genas,69,,,69277000BI0048,,,99,,,,,,,,,,1,4,Local industriel. commercial ou assimilé,11,0,,,,,,4.977448,45.718319
2020-965383,2020-01-20,000001,Vente en l'état futur d'achèvement,450000,15,,RUE DE L AVENIR,0040,69740,69277,Genas,69,,,69277000BI0048,,,100,,,,,,,,,,1,4,Local industriel. commercial ou assimilé,11,0,,,,,,4.977448,45.718319
2020-965737,2020-01-28,000001,Vente,262646,,,IMP HILAIRE CHARDONNET,0419,69740,69277,Genas,69,,,69277000AI0505,,,,,,,,,,,,,0,,,,,AB,terrains a bâtir,,,1,5.011431,45.740464
2020-965737,2020-01-28,000001,Vente,262646,14,B,IMP HILAIRE CHARDONNET,0419,69740,69277,Genas,69,,,69277000AI0507,,,,,,,,,,,,,0,,,,,AB,terrains a bâtir,,,34,5.011276,45.740373
2020-965737,2020-01-28,000001,Vente,262646,14,B,IMP HILAIRE CHARDONNET,0419,69740,69277,Genas,69,,,69277000AI0508,,,,,,,,,,,,,0,,,,,S,sols,,,465,5.011426,45.740386
2020-965755,2020-01-31,000001,Vente,1578493.5,13,,RUE JEAN ROSTAND,0518,69740,69277,Genas,69,,,69277000BH0349,,,,,,,,,,,,,0,4,Local industriel. commercial ou assimilé,,,S,sols,,,19501,4.983747,45.716096
2020-965938,2020-02-20,000001,Vente,539000,,,RUE SAINT-EXUPERY,0930,69740,69277,Genas,69,,,69277000AO0042,,,,,,,,,,,,,0,,,,,S,sols,,,1928,5.019368,45.736697
2020-965938,2020-02-20,000001,Vente,539000,8,,RUE SAINT-EXUPERY,0930,69740,69277,Genas,69,,,69277000AO0043,,,,,,,,,,,,,0,1,Maison,91,5,S,sols,,,520,5.019798,45.736392
2020-965938,2020-02-20,000001,Vente,539000,8,,RUE SAINT-EXUPERY,0930,69740,69277,Genas,69,,,69277000AO0043,,,,,,,,,,,,,0,1,Maison,91,5,AG,terrains d'agrément,,,478,5.019798,45.736392
2020-965941,2020-01-31,000001,Vente,4800000,13,,RUE JEAN ROSTAND,0518,69740,69277,Genas,69,,,69277000BH0349,,,,,,,,,,,,,0,4,Local industriel. commercial ou assimilé,,,S,sols,,,19501,4.983747,45.716096
2020-965993,2020-02-03,000001,Vente en l'état futur d'achèvement,242000,6,,RUE DANTON,0180,69740,69277,Genas,69,,,69277000AD0758,,,43,,,,,,,,,,1,2,Appartement,48,2,,,,,,5.002463,45.732049
2020-966097,2020-02-24,000001,Vente,78600,29,,RUE ROGER SALENGRO,0905,69740,69277,Genas,69,,,69277000BI0055,,,,,,,,,,,,,0,,,,,S,sols,,,547,4.979421,45.719777
2020-966097,2020-02-24,000001,Vente,78600,29,,RUE ROGER SALENGRO,0905,69740,69277,Genas,69,,,69277000BI0057,,,,,,,,,,,,,0,,,,,S,sols,,,437,4.979425,45.719877
2020-966097,2020-02-24,000001,Vente,78600,29,,RUE ROGER SALENGRO,0905,69740,69277,Genas,69,,,69277000BI0059,,,,,,,,,,,,,0,,,,,S,sols,,,109,4.979443,45.719798
2020-966140,2020-02-18,000001,Vente en l'état futur d'achèvement,255595,6,,RUE DANTON,0180,69740,69277,Genas,69,,,69277000AD0758,,,154,,,,,,,,,,1,3,Dépendance,,0,,,,,,5.002463,45.732049
2020-966140,2020-02-18,000001,Vente en l'état futur d'achèvement,255595,6,,RUE DANTON,0180,69740,69277,Genas,69,,,69277000AD0758,,,41,,,,,,,,,,1,2,Appartement,50,2,,,,,,5.002463,45.732049
2020-966140,2020-02-18,000001,Vente en l'état futur d'achèvement,255595,6,,RUE DANTON,0180,69740,69277,Genas,69,,,69277000AD0758,,,133,,,,,,,,,,1,3,Dépendance,,0,,,,,,5.002463,45.732049
2020-966151,2020-02-17,000001,Vente en l'état futur d'achèvement,362200,6,,RUE DANTON,0180,69740,69277,Genas,69,,,69277000AD0758,,,33,,,,,,,,,,1,3,Dépendance,,0,,,,,,5.002463,45.732049
2020-966151,2020-02-17,000001,Vente en l'état futur d'achèvement,362200,6,,RUE DANTON,0180,69740,69277,Genas,69,,,69277000AD0758,,,137,,,,,,,,,,1,3,Dépendance,,0,,,,,,5.002463,45.732049
2020-966151,2020-02-17,000001,Vente en l'état futur d'achèvement,362200,6,,RUE DANTON,0180,69740,69277,Genas,69,,,69277000AD0758,,,34,,,,,,,,,,1,2,Appartement,70,3,,,,,,5.002463,45.732049
2020-966151,2020-02-17,000001,Vente en l'état futur d'achèvement,362200,6,,RUE DANTON,0180,69740,69277,Genas,69,,,69277000AD0758,,,157,,,,,,,,,,1,3,Dépendance,,0,,,,,,5.002463,45.732049
2020-966183,2020-03-02,000001,Vente,249000,8,B,RUE PARMENTIER,0700,69740,69277,Genas,69,,,69277000BB0380,,,2,66.77,,,,,,,,,1,2,Appartement,66,3,,,,,,5.009964,45.718545
2020-966216,2020-02-27,000001,Vente en l'état futur d'achèvement,425000,,,LES GARENNES,B018,69740,69277,Genas,69,,,69277000AL0328,,,26,,,,,,,,,,1,1,Maison,127,5,,,,,,5.017979,45.744858
2020-966216,2020-02-27,000001,Vente en l'état futur d'achèvement,425000,,,LES GARENNES,B018,69740,69277,Genas,69,,,69277000AL0328,,,26,,,,,,,,,,1,3,Dépendance,,0,,,,,,5.017979,45.744858
2020-966240,2020-02-21,000001,Vente,88600,,,RATABIZET,B040,69740,69277,Genas,69,,,69277000ZO0019,,,,,,,,,,,,,0,,,,,T,terres,,,5580,,
2020-966253,2020-02-21,000001,Vente,554000,9,,ALL DES PLATANES,0788,69740,69277,Genas,69,,,69277000AD0087,,,,,,,,,,,,,0,1,Maison,84,5,S,sols,,,700,5.000588,45.734017
2020-966328,2020-02-26,000001,Vente en l'état futur d'achèvement,667000,6,,RUE DANTON,0180,69740,69277,Genas,69,,,69277000AD0758,,,110,,,,,,,,,,1,3,Dépendance,,0,,,,,,5.002463,45.732049
2020-966328,2020-02-26,000001,Vente en l'état futur d'achèvement,667000,6,,RUE DANTON,0180,69740,69277,Genas,69,,,69277000AD0758,,,23,,,,,,,,,,1,2,Appartement,130,5,,,,,,5.002463,45.732049
2020-966328,2020-02-26,000001,Vente en l'état futur d'achèvement,667000,6,,RUE DANTON,0180,69740,69277,Genas,69,,,69277000AD0758,,,111,,,,,,,,,,1,3,Dépendance,,0,,,,,,5.002463,45.732049
2020-966330,2020-02-26,000001,Vente en l'état futur d'achèvement,172000,6,,RUE DANTON,0180,69740,69277,Genas,69,,,69277000AD0758,,,131,,,,,,,,,,1,3,Dépendance,,0,,,,,,5.002463,45.732049
2020-966330,2020-02-26,000001,Vente en l'état futur d'achèvement,172000,6,,RUE DANTON,0180,69740,69277,Genas,69,,,69277000AD0758,,,6,,,,,,,,,,1,2,Appartement,30,1,,,,,,5.002463,45.732049
2020-966332,2020-02-25,000001,Vente en l'état futur d'achèvement,470800,6,,RUE DANTON,0180,69740,69277,Genas,69,,,69277000AD0758,,,114,,,,,,,,,,1,3,Dépendance,,0,,,,,,5.002463,45.732049
2020-966332,2020-02-25,000001,Vente en l'état futur d'achèvement,470800,6,,RUE DANTON,0180,69740,69277,Genas,69,,,69277000AD0758,,,31,,,,,,,,,,1,3,Dépendance,,0,,,,,,5.002463,45.732049
2020-966332,2020-02-25,000001,Vente en l'état futur d'achèvement,470800,6,,RUE DANTON,0180,69740,69277,Genas,69,,,69277000AD0758,,,32,,,,,,,,,,1,2,Appartement,91,3,,,,,,5.002463,45.732049
2020-966355,2020-03-09,000001,Vente,621300,21,,RUE DU CHATEAU D EAU,0140,69740,69277,Genas,69,,,69277000AE0047,,,1,143.84,,,,,,,,,1,1,Maison,140,6,,,,,,5.00594,45.735187
2020-966366,2020-03-06,000001,Vente,420000,14,,RUE DU 11 NOVEMBRE,0670,69740,69277,Genas,69,,,69277000AO0067,,,,,,,,,,,,,0,1,Maison,143,6,S,sols,,,879,5.020601,45.735149
2020-966387,2020-03-02,000001,Vente,450000,12,,RUE DE LA FRATERNITE,0280,69740,69277,Genas,69,,,69277000AR0123,,,,,,,,,,,,,0,1,Maison,140,8,S,sols,,,600,5.028065,45.72872
2020-966460,2020-03-04,000001,Vente en l'état futur d'achèvement,394200,6,,RUE DANTON,0180,69740,69277,Genas,69,,,69277000AD0758,,,141,,,,,,,,,,1,3,Dépendance,,0,,,,,,5.002463,45.732049
2020-966460,2020-03-04,000001,Vente en l'état futur d'achèvement,394200,6,,RUE DANTON,0180,69740,69277,Genas,69,,,69277000AD0758,,,116,,,,,,,,,,1,3,Dépendance,,0,,,,,,5.002463,45.732049
2020-966460,2020-03-04,000001,Vente en l'état futur d'achèvement,394200,6,,RUE DANTON,0180,69740,69277,Genas,69,,,69277000AD0758,,,17,,,,,,,,,,1,2,Appartement,74,3,,,,,,5.002463,45.732049
2020-966470,2020-02-25,000001,Vente,2395302.8,6,,RUE DANTON,0180,69740,69277,Genas,69,,,69277000AD0758,,,98,,,,,,,,,,1,3,Dépendance,,0,,,,,,5.002463,45.732049
2020-966470,2020-02-25,000001,Vente,2395302.8,6,,RUE DANTON,0180,69740,69277,Genas,69,,,69277000AD0758,,,104,,,,,,,,,,1,3,Dépendance,,0,,,,,,5.002463,45.732049
2020-966470,2020-02-25,000001,Vente,2395302.8,6,,RUE DANTON,0180,69740,69277,Genas,69,,,69277000AD0758,,,103,,,,,,,,,,1,3,Dépendance,,0,,,,,,5.002463,45.732049
2020-966470,2020-02-25,000001,Vente,2395302.8,6,,RUE DANTON,0180,69740,69277,Genas,69,,,69277000AD0758,,,102,,,,,,,,,,1,3,Dépendance,,0,,,,,,5.002463,45.732049
2020-966470,2020-02-25,000001,Vente,2395302.8,6,,RUE DANTON,0180,69740,69277,Genas,69,,,69277000AD0758,,,101,,,,,,,,,,1,3,Dépendance,,0,,,,,,5.002463,45.732049
2020-966470,2020-02-25,000001,Vente,2395302.8,6,,RUE DANTON,0180,69740,69277,Genas,69,,,69277000AD0758,,,100,,,,,,,,,,1,3,Dépendance,,0,,,,,,5.002463,45.732049
2020-966470,2020-02-25,000001,Vente,2395302.8,6,,RUE DANTON,0180,69740,69277,Genas,69,,,69277000AD0758,,,99,,,,,,,,,,1,3,Dépendance,,0,,,,,,5.002463,45.732049
2020-966470,2020-02-25,000001,Vente,2395302.8,6,,RUE DANTON,0180,69740,69277,Genas,69,,,69277000AD0758,,,97,,,,,,,,,,1,3,Dépendance,,0,,,,,,5.002463,45.732049
2020-966470,2020-02-25,000001,Vente,2395302.8,6,,RUE DANTON,0180,69740,69277,Genas,69,,,69277000AD0758,,,96,,,,,,,,,,1,3,Dépendance,,0,,,,,,5.002463,45.732049
2020-966470,2020-02-25,000001,Vente,2395302.8,6,,RUE DANTON,0180,69740,69277,Genas,69,,,69277000AD0758,,,95,,,,,,,,,,1,3,Dépendance,,0,,,,,,5.002463,45.732049
2020-966470,2020-02-25,000001,Vente,2395302.8,6,,RUE DANTON,0180,69740,69277,Genas,69,,,69277000AD0758,,,94,,,,,,,,,,1,3,Dépendance,,0,,,,,,5.002463,45.732049
2020-966470,2020-02-25,000001,Vente,2395302.8,6,,RUE DANTON,0180,69740,69277,Genas,69,,,69277000AD0758,,,93,,,,,,,,,,1,3,Dépendance,,0,,,,,,5.002463,45.732049
2020-966470,2020-02-25,000001,Vente,2395302.8,6,,RUE DANTON,0180,69740,69277,Genas,69,,,69277000AD0758,,,92,,,,,,,,,,1,3,Dépendance,,0,,,,,,5.002463,45.732049
2020-966470,2020-02-25,000001,Vente,2395302.8,6,,RUE DANTON,0180,69740,69277,Genas,69,,,69277000AD0758,,,91,,,,,,,,,,1,3,Dépendance,,0,,,,,,5.002463,45.732049
2020-966470,2020-02-25,000001,Vente,2395302.8,6,,RUE DANTON,0180,69740,69277,Genas,69,,,69277000AD0758,,,90,,,,,,,,,,1,3,Dépendance,,0,,,,,,5.002463,45.732049
2020-966470,2020-02-25,000001,Vente,2395302.8,6,,RUE DANTON,0180,69740,69277,Genas,69,,,69277000AD0758,,,47,,,,,,,,,,1,2,Appartement,78,4,,,,,,5.002463,45.732049
2020-966470,2020-02-25,000001,Vente,2395302.8,6,,RUE DANTON,0180,69740,69277,Genas,69,,,69277000AD0758,,,46,,,,,,,,,,1,2,Appartement,90,5,,,,,,5.002463,45.732049
2020-966470,2020-02-25,000001,Vente,2395302.8,6,,RUE DANTON,0180,69740,69277,Genas,69,,,69277000AD0758,,,45,,,,,,,,,,1,2,Appartement,29,1,,,,,,5.002463,45.732049
2020-966470,2020-02-25,000001,Vente,2395302.8,6,,RUE DANTON,0180,69740,69277,Genas,69,,,69277000AD0758,,,44,,,,,,,,,,1,2,Appartement,77,4,,,,,,5.002463,45.732049
2020-966470,2020-02-25,000001,Vente,2395302.8,6,,RUE DANTON,0180,69740,69277,Genas,69,,,69277000AD0758,,,37,,,,,,,,,,1,2,Appartement,46,2,,,,,,5.002463,45.732049
2020-966470,2020-02-25,000001,Vente,2395302.8,6,,RUE DANTON,0180,69740,69277,Genas,69,,,69277000AD0758,,,36,,,,,,,,,,1,2,Appartement,44,2,,,,,,5.002463,45.732049
2020-966470,2020-02-25,000001,Vente,2395302.8,6,,RUE DANTON,0180,69740,69277,Genas,69,,,69277000AD0758,,,50,,,,,,,,,,1,2,Appartement,55,2,,,,,,5.002463,45.732049
2020-966470,2020-02-25,000001,Vente,2395302.8,6,,RUE DANTON,0180,69740,69277,Genas,69,,,69277000AD0758,,,89,,,,,,,,,,1,3,Dépendance,,0,,,,,,5.002463,45.732049
2020-966470,2020-02-25,000001,Vente,2395302.8,6,,RUE DANTON,0180,69740,69277,Genas,69,,,69277000AD0758,,,51,,,,,,,,,,1,2,Appartement,44,2,,,,,,5.002463,45.732049
2020-966470,2020-02-25,000001,Vente,2395302.8,6,,RUE DANTON,0180,69740,69277,Genas,69,,,69277000AD0758,,,52,,,,,,,,,,1,2,Appartement,59,3,,,,,,5.002463,45.732049
2020-966470,2020-02-25,000001,Vente,2395302.8,6,,RUE DANTON,0180,69740,69277,Genas,69,,,69277000AD0758,,,53,,,,,,,,,,1,2,Appartement,64,3,,,,,,5.002463,45.732049
2020-966470,2020-02-25,000001,Vente,2395302.8,6,,RUE DANTON,0180,69740,69277,Genas,69,,,69277000AD0758,,,54,,,,,,,,,,1,2,Appartement,45,2,,,,,,5.002463,45.732049
2020-966470,2020-02-25,000001,Vente,2395302.8,6,,RUE DANTON,0180,69740,69277,Genas,69,,,69277000AD0758,,,55,,,,,,,,,,1,2,Appartement,65,3,,,,,,5.002463,45.732049
2020-966470,2020-02-25,000001,Vente,2395302.8,6,,RUE DANTON,0180,69740,69277,Genas,69,,,69277000AD0758,,,57,,,,,,,,,,1,2,Appartement,50,2,,,,,,5.002463,45.732049
2020-966470,2020-02-25,000001,Vente,2395302.8,6,,RUE DANTON,0180,69740,69277,Genas,69,,,69277000AD0758,,,56,,,,,,,,,,1,2,Appartement,66,3,,,,,,5.002463,45.732049
2020-966470,2020-02-25,000001,Vente,2395302.8,6,,RUE DANTON,0180,69740,69277,Genas,69,,,69277000AD0758,,,49,,,,,,,,,,1,2,Appartement,45,2,,,,,,5.002463,45.732049
2020-966470,2020-02-25,000001,Vente,2395302.8,6,,RUE DANTON,0180,69740,69277,Genas,69,,,69277000AD0758,,,48,,,,,,,,,,1,2,Appartement,64,3,,,,,,5.002463,45.732049
2020-966532,2020-02-28,000001,Vente,365000,26,A,RUE PASTEUR,0720,69740,69277,Genas,69,,,69277000AP0347,,,,,,,,,,,,,0,,,,,S,sols,,,96,5.019182,45.732245
2020-966532,2020-02-28,000001,Vente,365000,26,A,RUE PASTEUR,0720,69740,69277,Genas,69,,,69277000AP0349,,,,,,,,,,,,,0,,,,,S,sols,,,160,5.01916,45.732153
2020-966532,2020-02-28,000001,Vente,365000,26,A,RUE PASTEUR,0720,69740,69277,Genas,69,,,69277000AP0351,,,,,,,,,,,,,0,,,,,S,sols,,,152,5.019173,45.732046
2020-966569,2020-02-19,000001,Vente,906880,8,,RUE HILAIRE CHARDONNET,0420,69740,69277,Genas,69,,,69277000AI0619,,,,,,,,,,,,,0,1,Maison,198,5,S,sols,,,800,5.014733,45.740584
2020-966569,2020-02-19,000001,Vente,906880,8,,RUE HILAIRE CHARDONNET,0420,69740,69277,Genas,69,,,69277000AI0619,,,,,,,,,,,,,0,1,Maison,198,5,AG,terrains d'agrément,,,466,5.014733,45.740584
2020-966569,2020-02-19,000001,Vente,906880,6,,RUE HILAIRE CHARDONNET,0420,69740,69277,Genas,69,,,69277000AI0645,,,,,,,,,,,,,0,,,,,S,sols,,,18,5.014596,45.74077
2020-966570,2020-02-19,000001,Vente,381450,17,C,RTE DE LYON,0600,69740,69277,Genas,69,,,69277000AA0366,,,,,,,,,,,,,0,1,Maison,88,4,S,sols,,,199,4.986866,45.73494
2020-966576,2020-02-19,000001,Vente,1,6,,RUE HILAIRE CHARDONNET,0420,69740,69277,Genas,69,,,69277000AI0645,,,,,,,,,,,,,0,,,,,S,sols,,,18,5.014596,45.74077
2020-966600,2020-03-12,000002,Vente,359000,13,,RUE VICTOR HUGO,0980,69740,69277,Genas,69,,,69277000AX0323,,,,,,,,,,,,,0,3,Dépendance,,0,S,sols,,,465,5.000668,45.7287
2020-966600,2020-03-12,000002,Vente,359000,13,,RUE VICTOR HUGO,0980,69740,69277,Genas,69,,,69277000AX0323,,,,,,,,,,,,,0,1,Maison,101,6,S,sols,,,465,5.000668,45.7287
2020-966733,2020-03-12,000001,Vente,353000,2,,RUE VICTOR HUGO,0980,69740,69277,Genas,69,,,69277000AY0277,,,6,79.43,,,,,,,,,1,2,Appartement,79,4,,,,,,5.001289,45.731443
2020-966733,2020-03-12,000001,Vente,353000,2,,RUE VICTOR HUGO,0980,69740,69277,Genas,69,,,69277000AY0277,,,49,,,,,,,,,,1,3,Dépendance,,0,,,,,,5.001289,45.731443
2020-966811,2020-03-17,000001,Vente,218000,,,RUE CARNOT,0120,69740,69277,Genas,69,,,69277000BB0385,,,,,,,,,,,,,0,,,,,AB,terrains a bâtir,,,237,5.008921,45.717362
2020-966873,2020-03-18,000002,Vente,425000,28,,RUE GAMBETTA,0340,69740,69277,Genas,69,,,69277000AT0503,,,,,,,,,,,,,0,1,Maison,136,6,S,sols,,,129,5.01733,45.734458
2020-966873,2020-03-18,000002,Vente,425000,28,,RUE GAMBETTA,0340,69740,69277,Genas,69,,,69277000AT0503,,,,,,,,,,,,,0,1,Maison,153,5,S,sols,,,129,5.01733,45.734458
2020-966911,2020-03-27,000001,Vente,375000,,,LES GDES TERRES,B022,69740,69277,Genas,69,,,69277000AB0072,,,,,,,,,,,,,0,,,,,S,sols,,,120,4.98903,45.733463
2020-966911,2020-03-27,000001,Vente,375000,8,,RUE DES MURIERS,0666,69740,69277,Genas,69,,,69277000AB0073,,,,,,,,,,,,,0,1,Maison,102,4,S,sols,,,702,4.989198,45.73331
2020-966911,2020-03-27,000001,Vente,375000,,,RUE DES MURIERS,0666,69740,69277,Genas,69,,,69277000AB0077,,,,,,,,,,,,,0,,,,,S,sols,,,931,4.989444,45.733399
2020-966979,2020-03-12,000001,Vente en l'état futur d'achèvement,300000,6,,RUE DANTON,0180,69740,69277,Genas,69,,,69277000AD0758,,,106,,,,,,,,,,1,,,,,,,,,,5.002463,45.732049
2020-966979,2020-03-12,000001,Vente en l'état futur d'achèvement,300000,6,,RUE DANTON,0180,69740,69277,Genas,69,,,69277000AD0758,,,28,,,,,,,,,,1,2,Appartement,59,3,,,,,,5.002463,45.732049
2020-967141,2020-04-17,000001,Vente,507700,44,,RUE DOC AMEDEE BONNET,0199,69740,69277,Genas,69,,,69277000AD0236,,,,,,,,,,,,,0,1,Maison,97,5,S,sols,,,257,5.004936,45.734182
2020-967141,2020-04-17,000001,Vente,507700,44,,RUE DOC AMEDEE BONNET,0199,69740,69277,Genas,69,,,69277000AD0272,,,,,,,,,,,,,0,,,,,S,sols,,,55,5.004964,45.73427
2020-967160,2020-04-15,000001,Vente,535000,7,,RUE KATIA KRAFFT,0541,69740,69277,Genas,69,,,69277000BH0190,,,,,,,,,,,,,0,1,Maison,151,5,S,sols,,,805,4.979941,45.714933
2020-967162,2020-04-20,000001,Vente,270000,,,SURJOUX,B050,69740,69277,Genas,69,,,69277000AW0160,,,,,,,,,,,,,0,,,,,AB,terrains a bâtir,,,435,5.008052,45.725084
2020-967167,2020-04-20,000001,Vente,235000,,,RUE CARNOT,0120,69740,69277,Genas,69,,,69277000BB0395,,,,,,,,,,,,,0,,,,,AB,terrains a bâtir,,,330,5.009416,45.717028
2020-967194,2020-04-17,000001,Vente,398000,28,,RUE GAMBETTA,0340,69740,69277,Genas,69,,,69277000AT0504,,,,,,,,,,,,,0,,,,,S,sols,,,136,5.017421,45.734465
2020-967224,2020-03-31,000001,Vente,300000,17,,RTE DE LYON,0600,69740,69277,Genas,69,,,69277000AA0134,,,,,,,,,,,,,0,1,Maison,76,3,S,sols,,,496,4.986491,45.735195
2020-967224,2020-03-31,000001,Vente,300000,17,,RTE DE LYON,0600,69740,69277,Genas,69,,,69277000AA0134,,,,,,,,,,,,,0,1,Maison,76,3,J,jardins,POTAG,Jardin potager,618,4.986491,45.735195
2020-967224,2020-03-31,000001,Vente,300000,17,,RTE DE LYON,0600,69740,69277,Genas,69,,,69277000AA0135,,,,,,,,,,,,,0,1,Maison,68,3,S,sols,,,556,4.986425,45.735028
2020-967228,2020-03-04,000001,Vente,499000,7,,RUE PIERRE DUPONT,0780,69740,69277,Genas,69,,,69277000AZ0373,,,3,,,,,,,,,,1,3,Dépendance,,0,,,,,,5.001271,45.723653
2020-967228,2020-03-04,000001,Vente,499000,7,,RUE PIERRE DUPONT,0780,69740,69277,Genas,69,,,69277000AZ0469,,,,,,,,,,,,,0,1,Maison,199,5,S,sols,,,944,5.001285,45.723441
2020-967277,2020-04-30,000001,Vente,541000,3,,ALL ANTOINE FERRIER,0019,69740,69277,Genas,69,,,69277000AC0387,,,41,,,,,,,,,,1,3,Dépendance,,0,,,,,,4.996749,45.731923
2020-967277,2020-04-30,000001,Vente,541000,1,,RUE DE LA LIBERTE,0580,69740,69277,Genas,69,,,69277000AC0387,,,35,101.5,,,,,,,,,1,2,Appartement,102,4,,,,,,4.996749,45.731923
2020-967277,2020-04-30,000001,Vente,541000,3,,ALL ANTOINE FERRIER,0019,69740,69277,Genas,69,,,69277000AC0387,,,42,,,,,,,,,,1,3,Dépendance,,0,,,,,,4.996749,45.731923
2020-967296,2020-04-22,000001,Vente,510000,22,B,RUE CARNOT,0120,69740,69277,Genas,69,,,69277000AZ0119,,,,,,,,,,,,,0,,,,,J,jardins,POTAG,Jardin potager,1565,,
2020-967296,2020-04-22,000001,Vente,510000,20,,RUE CARNOT,0120,69740,69277,Genas,69,,,69277000AZ0283,,,,,,,,,,,,,0,1,Maison,32,1,S,sols,,,20,5.004501,45.722874
2020-967299,2020-04-29,000001,Vente,926975.7,5,,RUE DANTON,0180,69740,69277,Genas,69,,,69277000AD0360,,,2,,,,,,,,,,1,2,Appartement,64,3,,,,,,5.001616,45.732486
2020-967299,2020-04-29,000001,Vente,926975.7,5,,RUE DANTON,0180,69740,69277,Genas,69,,,69277000AD0360,,,5,,,,,,,,,,1,2,Appartement,65,3,,,,,,5.001616,45.732486
2020-967299,2020-04-29,000001,Vente,926975.7,5,,RUE DANTON,0180,69740,69277,Genas,69,,,69277000AD0360,,,1,,,,,,,,,,1,2,Appartement,81,4,,,,,,5.001616,45.732486
2020-967299,2020-04-29,000001,Vente,926975.7,5,,RUE DANTON,0180,69740,69277,Genas,69,,,69277000AD0360,,,43,,,,,,,,,,1,3,Dépendance,,0,,,,,,5.001616,45.732486
2020-967299,2020-04-29,000001,Vente,926975.7,5,,RUE DANTON,0180,69740,69277,Genas,69,,,69277000AD0360,,,37,,,,,,,,,,1,3,Dépendance,,0,,,,,,5.001616,45.732486
2020-967299,2020-04-29,000001,Vente,926975.7,5,,RUE DANTON,0180,69740,69277,Genas,69,,,69277000AD0360,,,36,,,,,,,,,,1,3,Dépendance,,0,,,,,,5.001616,45.732486
2020-967299,2020-04-29,000001,Vente,926975.7,5,,RUE DANTON,0180,69740,69277,Genas,69,,,69277000AD0360,,,9,,,,,,,,,,1,2,Appartement,65,3,,,,,,5.001616,45.732486
2020-967299,2020-04-29,000001,Vente,926975.7,5,,RUE DANTON,0180,69740,69277,Genas,69,,,69277000AD0360,,,33,,,,,,,,,,1,3,Dépendance,,0,,,,,,5.001616,45.732486
2020-967299,2020-04-29,000001,Vente,926975.7,5,,RUE DANTON,0180,69740,69277,Genas,69,,,69277000AD0360,,,32,,,,,,,,,,1,3,Dépendance,,0,,,,,,5.001616,45.732486
2020-967299,2020-04-29,000001,Vente,926975.7,5,,RUE DANTON,0180,69740,69277,Genas,69,,,69277000AD0360,,,4,,,,,,,,,,1,2,Appartement,86,4,,,,,,5.001616,45.732486