id_mutation,date_mutation,numero_disposition,nature_mutation,valeur_fonciere,adresse_numero,adresse_suffixe,adresse_nom_voie,adresse_code_voie,code_postal,code_commune,nom_commune,code_departement,ancien_code_commune,ancien_nom_commune,id_parcelle,ancien_id_parcelle,numero_volume,lot1_numero,lot1_surface_carrez,lot2_numero,lot2_surface_carrez,lot3_numero,lot3_surface_carrez,lot4_numero,lot4_surface_carrez,lot5_numero,lot5_surface_carrez,nombre_lots,code_type_local,type_local,surface_reelle_bati,nombre_pieces_principales,code_nature_culture,nature_culture,code_nature_culture_speciale,nature_culture_speciale,surface_terrain,longitude,latitude
2020-990197,2020-01-30,000001,Vente,65000,11,,RUE DU BLINLOUP,0028,70800,70097,Briaucourt,70,,,70097000AB0003,,,,,,,,,,,,,0,1,Maison,144,5,AG,terrains d'agrément,,,1660,6.243167,47.8207
2020-990197,2020-01-30,000001,Vente,65000,11,,RUE DU BLINLOUP,0028,70800,70097,Briaucourt,70,,,70097000AB0003,,,,,,,,,,,,,0,1,Maison,144,5,S,sols,,,1000,6.243167,47.8207
2020-990281,2020-02-17,000001,Vente,14775,,,EN CONTOUR,B036,70800,70097,Briaucourt,70,,,70097000AB0101,,,,,,,,,,,,,0,,,,,AB,terrains a bâtir,,,986,6.244153,47.820693
2020-990299,2020-02-10,000001,Vente,4818,,,AUX OURMES,B078,70800,70097,Briaucourt,70,,,70097000ZB0077,,,,,,,,,,,,,0,,,,,T,terres,,,6093,6.238046,47.83135
2020-990299,2020-02-10,000001,Vente,4818,,,AUX OURMES,B078,70800,70097,Briaucourt,70,,,70097000ZB0077,,,,,,,,,,,,,0,,,,,T,terres,,,13179,6.238046,47.83135
2020-990627,2020-03-17,000001,Vente,21500,3,,RUE DU PRE BRESSON,0030,70800,70097,Briaucourt,70,,,70097000AA0051,,,,,,,,,,,,,0,1,Maison,84,3,S,sols,,,803,6.248237,47.826541
2020-990627,2020-03-17,000001,Vente,21500,,,HAUT DES VIGNES,B067,70800,70097,Briaucourt,70,,,70097000AA0052,,,,,,,,,,,,,0,,,,,VE,vergers,,,2078,6.248695,47.827151
2020-990671,2020-05-14,000001,Vente,70000,7,,RUE DES NOYERS,0100,70800,70097,Briaucourt,70,,,70097000AB0111,,,,,,,,,,,,,0,1,Maison,80,4,S,sols,,,1000,,
2020-990671,2020-05-14,000001,Vente,70000,7,,RUE DES NOYERS,0100,70800,70097,Briaucourt,70,,,70097000AB0111,,,,,,,,,,,,,0,1,Maison,80,4,P,prés,,,2861,,
2020-990819,2020-05-27,000001,Echange,300,,,LA BROSSE DE LA CHARME,B004,70800,70097,Briaucourt,70,,,70097000ZH0050,,,,,,,,,,,,,0,,,,,BT,taillis simples,,,1090,6.234029,47.825082
2020-990842,2020-05-27,000001,Vente,4000,,,LES RATEUX,B100,70800,70097,Briaucourt,70,,,700970000B0389,,,,,,,,,,,,,0,,,,,L,landes,,,1005,6.258629,47.825519
2020-990842,2020-05-27,000001,Vente,4000,,,LES RATEUX,B100,70800,70097,Briaucourt,70,,,700970000B0390,,,,,,,,,,,,,0,,,,,BT,taillis simples,,,3190,6.257586,47.824996
2020-990842,2020-05-27,000001,Vente,4000,,,LES RATEUX,B100,70800,70097,Briaucourt,70,,,700970000B0393,,,,,,,,,,,,,0,,,,,L,landes,,,950,6.256576,47.824767
2020-990842,2020-05-27,000001,Vente,4000,,,LA CORNE DES CENT CHENES,B037,70800,70097,Briaucourt,70,,,700970000B0457,,,,,,,,,,,,,0,,,,,BT,taillis simples,,,3380,6.263768,47.825037
2020-990842,2020-05-27,000001,Vente,4000,,,LA CORNE DES CENT CHENES,B037,70800,70097,Briaucourt,70,,,700970000B0458,,,,,,,,,,,,,0,,,,,BT,taillis simples,,,2260,6.262705,47.824576
2020-990842,2020-05-27,000001,Vente,4000,,,HAUT DE MOLIERE,B064,70800,70097,Briaucourt,70,,,70097000ZB0005,,,,,,,,,,,,,0,,,,,BT,taillis simples,,,1714,6.242604,47.835628
2020-990930,2020-06-12,000001,Vente,61000,8,,RUE DE LA MAIRIE,0065,70800,70097,Briaucourt,70,,,70097000AA0203,,,,,,,,,,,,,0,1,Maison,83,3,S,sols,,,132,6.248393,47.823211
2020-991306,2020-08-04,000001,Vente,1000,,,AUX CALEUCHES,B006,70800,70097,Briaucourt,70,,,700970000B0424,,,,,,,,,,,,,0,,,,,BT,taillis simples,,,4710,6.261683,47.826752
