id_mutation,date_mutation,numero_disposition,nature_mutation,valeur_fonciere,adresse_numero,adresse_suffixe,adresse_nom_voie,adresse_code_voie,code_postal,code_commune,nom_commune,code_departement,ancien_code_commune,ancien_nom_commune,id_parcelle,ancien_id_parcelle,numero_volume,lot1_numero,lot1_surface_carrez,lot2_numero,lot2_surface_carrez,lot3_numero,lot3_surface_carrez,lot4_numero,lot4_surface_carrez,lot5_numero,lot5_surface_carrez,nombre_lots,code_type_local,type_local,surface_reelle_bati,nombre_pieces_principales,code_nature_culture,nature_culture,code_nature_culture_speciale,nature_culture_speciale,surface_terrain,longitude,latitude
2020-990643,2020-05-15,000001,Vente,2200,,,SUR LA VILLE,B065,70400,70187,Crevans-et-la-Chapelle-lès-Granges,70,,,70187000ZH0027,,,,,,,,,,,,,0,,,,,T,terres,,,9711,6.586191,47.554887
2020-990646,2020-05-18,000001,Vente,3000,,,DERRIERE CHEZ FROMONT,B017,70400,70187,Crevans-et-la-Chapelle-lès-Granges,70,,,70187000ZA0014,,,,,,,,,,,,,0,,,,,VE,vergers,,,1190,6.582257,47.55365
2020-990848,2020-06-12,000002,Vente,1000,,,SUR LA VILLE,B065,70400,70187,Crevans-et-la-Chapelle-lès-Granges,70,,,70187000ZH0067,,,,,,,,,,,,,0,,,,,T,terres,,,228,6.584042,47.553522
2020-991379,2020-09-07,000001,Vente,131400,,,PRES NEUFS,B042,70400,70187,Crevans-et-la-Chapelle-lès-Granges,70,,,70187000ZB0045,,,,,,,,,,,,,0,,,,,S,sols,,,50,6.587882,47.55075
2020-991379,2020-09-07,000001,Vente,131400,1,,IMP DES PRES NEUFS,0061,70400,70187,Crevans-et-la-Chapelle-lès-Granges,70,,,70187000ZB0046,,,,,,,,,,,,,0,1,Maison,96,5,S,sols,,,500,6.587783,47.551008
2020-991379,2020-09-07,000001,Vente,131400,1,,IMP DES PRES NEUFS,0061,70400,70187,Crevans-et-la-Chapelle-lès-Granges,70,,,70187000ZB0046,,,,,,,,,,,,,0,1,Maison,96,5,T,terres,,,565,6.587783,47.551008
2020-992045,2020-11-20,000001,Vente,3000,,,LES BLANCHARDS,B001,70400,70187,Crevans-et-la-Chapelle-lès-Granges,70,,,70187000ZK0077,,,,,,,,,,,,,0,,,,,T,terres,,,2833,6.599107,47.543122
2020-992124,2020-12-04,000001,Vente,10000,2,,CHEM DES VIGNES,0070,70400,70187,Crevans-et-la-Chapelle-lès-Granges,70,,,70187000ZK0043,,,,,,,,,,,,,0,1,Maison,42,2,S,sols,,,2066,6.599564,47.545814
2020-992337,2020-12-23,000001,Vente,184450,1,,RUE DES BLANCHARDS,0007,70400,70187,Crevans-et-la-Chapelle-lès-Granges,70,,,70187000ZC0058,,,,,,,,,,,,,0,1,Maison,110,6,S,sols,,,962,6.599555,47.543537
2020-992337,2020-12-23,000001,Vente,184450,1,,RUE DES BLANCHARDS,0007,70400,70187,Crevans-et-la-Chapelle-lès-Granges,70,,,70187000ZC0058,,,,,,,,,,,,,0,1,Maison,110,6,J,jardins,,,115,6.599555,47.543537
2020-992337,2020-12-23,000001,Vente,184450,1,,RUE DES BLANCHARDS,0007,70400,70187,Crevans-et-la-Chapelle-lès-Granges,70,,,70187000ZC0058,,,,,,,,,,,,,0,1,Maison,110,6,T,terres,,,285,6.599555,47.543537
