id_mutation,date_mutation,numero_disposition,nature_mutation,valeur_fonciere,adresse_numero,adresse_suffixe,adresse_nom_voie,adresse_code_voie,code_postal,code_commune,nom_commune,code_departement,ancien_code_commune,ancien_nom_commune,id_parcelle,ancien_id_parcelle,numero_volume,lot1_numero,lot1_surface_carrez,lot2_numero,lot2_surface_carrez,lot3_numero,lot3_surface_carrez,lot4_numero,lot4_surface_carrez,lot5_numero,lot5_surface_carrez,nombre_lots,code_type_local,type_local,surface_reelle_bati,nombre_pieces_principales,code_nature_culture,nature_culture,code_nature_culture_speciale,nature_culture_speciale,surface_terrain,longitude,latitude
2020-990221,2020-01-31,000001,Vente,2200,,,BRUMBIEF,B030,70310,70217,Esmoulières,70,,,702170000C0271,,,,,,,,,,,,,0,,,,,P,prés,,,3755,6.632542,47.86072
2020-990221,2020-01-31,000001,Vente,2200,,,LA COTE DE JURE,B080,70310,70217,Esmoulières,70,,,702170000C0287,,,,,,,,,,,,,0,,,,,L,landes,,,3825,6.629296,47.860796
2020-990291,2020-02-14,000001,Vente,3500,,,MENEUVRES SOUS LE CHANOIS,B173,70310,70217,Esmoulières,70,,,702170000A0086,,,,,,,,,,,,,0,,,,,BR,futaies résineuses,,,1162,6.610039,47.872508
2020-990291,2020-02-14,000001,Vente,3500,,,MENEUVRES SOUS LE CHANOIS,B173,70310,70217,Esmoulières,70,,,702170000A0087,,,,,,,,,,,,,0,,,,,BR,futaies résineuses,,,1323,6.609821,47.872396
2020-990291,2020-02-14,000001,Vente,3500,,,FAIS ENTRE LES GOUTTES,B110,70310,70217,Esmoulières,70,,,702170000A0091,,,,,,,,,,,,,0,,,,,L,landes,,,1002,6.610726,47.873644
2020-990291,2020-02-14,000001,Vente,3500,,,FAIS ENTRE LES GOUTTES,B110,70310,70217,Esmoulières,70,,,702170000A0092,,,,,,,,,,,,,0,,,,,BR,futaies résineuses,,,4480,6.608834,47.873083
2020-990291,2020-02-14,000001,Vente,3500,,,FAIS ENTRE LES GOUTTES,B110,70310,70217,Esmoulières,70,,,702170000A0092,,,,,,,,,,,,,0,,,,,L,landes,,,33080,6.608834,47.873083
2020-990291,2020-02-14,000001,Vente,3500,,,LE CHANOIS 1ER CANTON,B062,70310,70217,Esmoulières,70,,,702170000A0353,,,,,,,,,,,,,0,,,,,BR,futaies résineuses,,,1258,6.607396,47.870909
2020-990291,2020-02-14,000001,Vente,3500,,,MENEUVRES SOUS LE CHANOIS,B173,70310,70217,Esmoulières,70,,,702170000A0355,,,,,,,,,,,,,0,,,,,P,prés,,,9990,6.608056,47.871554
2020-991616,2020-10-02,000001,Vente,220000,,,LES BESSES,B005,70310,70217,Esmoulières,70,,,702170000B0184,,,,,,,,,,,,,0,,,,,T,terres,,,803,6.617821,47.860158
2020-991616,2020-10-02,000001,Vente,220000,,,LES BESSES,B005,70310,70217,Esmoulières,70,,,702170000B0185,,,,,,,,,,,,,0,,,,,BT,taillis simples,,,641,6.617852,47.860002
2020-991616,2020-10-02,000001,Vente,220000,,,LES BESSES,B005,70310,70217,Esmoulières,70,,,702170000B0186,,,,,,,,,,,,,0,,,,,P,prés,,,4236,6.618492,47.859744
2020-991616,2020-10-02,000001,Vente,220000,,,LES BESSES,B005,70310,70217,Esmoulières,70,,,702170000B0187,,,,,,,,,,,,,0,,,,,BT,taillis simples,,,686,6.618587,47.859647
2020-991616,2020-10-02,000001,Vente,220000,,,LES BESSES,B005,70310,70217,Esmoulières,70,,,702170000B0188,,,,,,,,,,,,,0,,,,,E,eaux,,,692,6.618625,47.860402
2020-991616,2020-10-02,000001,Vente,220000,,,LES BESSES,B005,70310,70217,Esmoulières,70,,,702170000B0189,,,,,,,,,,,,,0,,,,,T,terres,,,3953,,
2020-991616,2020-10-02,000001,Vente,220000,,,LES BESSES,B005,70310,70217,Esmoulières,70,,,702170000B0190,,,,,,,,,,,,,0,,,,,L,landes,,,25251,,
2020-991616,2020-10-02,000001,Vente,220000,,,LES BESSES,B005,70310,70217,Esmoulières,70,,,702170000B0191,,,,,,,,,,,,,0,,,,,P,prés,,,7402,,
2020-991616,2020-10-02,000001,Vente,220000,3,,LES CONCHOTTES,0060,70310,70217,Esmoulières,70,,,702170000B0192,,,,,,,,,,,,,0,1,Maison,77,6,S,sols,,,1311,6.621142,47.859867
2020-991616,2020-10-02,000001,Vente,220000,,,LES BESSES,B005,70310,70217,Esmoulières,70,,,702170000B0193,,,,,,,,,,,,,0,,,,,T,terres,,,8995,,
2020-991616,2020-10-02,000001,Vente,220000,,,LES BESSES,B005,70310,70217,Esmoulières,70,,,702170000B0194,,,,,,,,,,,,,0,,,,,L,landes,,,787,6.620984,47.861066
2020-991616,2020-10-02,000001,Vente,220000,,,COMBE AUX DAIMS,B074,70310,70217,Esmoulières,70,,,702170000B0252,,,,,,,,,,,,,0,,,,,L,landes,,,360,6.625378,47.860491
2020-991616,2020-10-02,000001,Vente,220000,,,LES SOMBRES,B238,70310,70217,Esmoulières,70,,,702170000B0366,,,,,,,,,,,,,0,,,,,E,eaux,,,37460,6.624104,47.859976
2020-991616,2020-10-02,000001,Vente,220000,,,LES SOMBRES,B238,70310,70217,Esmoulières,70,,,702170000B0367,,,,,,,,,,,,,0,,,,,J,jardins,,,216,6.621488,47.859944
2020-991616,2020-10-02,000001,Vente,220000,,,CHAMPS BLANCHOTS,B047,70310,70217,Esmoulières,70,,,702170000B0370,,,,,,,,,,,,,0,,,,,T,terres,,,2450,,
2020-991616,2020-10-02,000001,Vente,220000,,,CHAMPS BLANCHOTS,B047,70310,70217,Esmoulières,70,,,702170000B0371,,,,,,,,,,,,,0,,,,,T,terres,,,3685,6.620734,47.858632
2020-991616,2020-10-02,000001,Vente,220000,,,CHAMPS BLANCHOTS,B047,70310,70217,Esmoulières,70,,,702170000B0386,,,,,,,,,,,,,0,,,,,T,terres,,,4730,6.618662,47.858783
2020-991616,2020-10-02,000001,Vente,220000,,,CHAMPS BLANCHOTS,B047,70310,70217,Esmoulières,70,,,702170000B0387,,,,,,,,,,,,,0,,,,,BT,taillis simples,,,5255,,
2020-991616,2020-10-02,000001,Vente,220000,,,CHAMPS BLANCHOTS,B047,70310,70217,Esmoulières,70,,,702170000B0388,,,,,,,,,,,,,0,,,,,L,landes,,,685,6.617957,47.858962
2020-991616,2020-10-02,000001,Vente,220000,,,LES BESSES,B005,70310,70217,Esmoulières,70,,,702170000B1326,,,,,,,,,,,,,0,,,,,BT,taillis simples,,,624,6.620468,47.861366
2020-991616,2020-10-02,000001,Vente,220000,,,LES BESSES,B005,70310,70217,Esmoulières,70,,,702170000B1328,,,,,,,,,,,,,0,,,,,L,landes,,,7704,6.62181,47.861714
2020-992162,2020-12-02,000001,Vente,1200,,,FAHY SAINT JEAN 2EME CANTO,B108,70310,70217,Esmoulières,70,,,702170000D0020,,,,,,,,,,,,,0,,,,,BT,taillis simples,,,3554,6.626315,47.835998
2020-992162,2020-12-02,000001,Vente,1200,,,FAHY SAINT JEAN 2EME CANTO,B108,70310,70217,Esmoulières,70,,,702170000D0021,,,,,,,,,,,,,0,,,,,BT,taillis simples,,,3373,6.626424,47.835511
2020-992162,2020-12-02,000001,Vente,1200,,,FAHY SAINT JEAN 2EME CANTO,B108,70310,70217,Esmoulières,70,,,702170000D0022,,,,,,,,,,,,,0,,,,,BT,taillis simples,,,8483,6.626725,47.835251
