id_mutation,date_mutation,numero_disposition,nature_mutation,valeur_fonciere,adresse_numero,adresse_suffixe,adresse_nom_voie,adresse_code_voie,code_postal,code_commune,nom_commune,code_departement,ancien_code_commune,ancien_nom_commune,id_parcelle,ancien_id_parcelle,numero_volume,lot1_numero,lot1_surface_carrez,lot2_numero,lot2_surface_carrez,lot3_numero,lot3_surface_carrez,lot4_numero,lot4_surface_carrez,lot5_numero,lot5_surface_carrez,nombre_lots,code_type_local,type_local,surface_reelle_bati,nombre_pieces_principales,code_nature_culture,nature_culture,code_nature_culture_speciale,nature_culture_speciale,surface_terrain,longitude,latitude
2020-992508,2020-01-23,000001,Vente,33930,,,LE VILLAGE,B136,70160,70236,Fleurey-lès-Faverney,70,,,702360000D0762,,,,,,,,,,,,,0,,,,,P,prés,,,91,6.080489,47.745284
2020-992508,2020-01-23,000001,Vente,33930,,,BAS DU CLOS,B006,70160,70236,Fleurey-lès-Faverney,70,,,70236000ZB0171,,,,,,,,,,,,,0,,,,,AB,terrains a bâtir,,,1040,6.080288,47.745379
2020-992578,2020-01-23,000001,Vente,20000,,,LE VILLAGE,B136,70160,70236,Fleurey-lès-Faverney,70,,,702360000D0679,,,,,,,,,,,,,0,,,,,J,jardins,,,116,6.082305,47.745845
2020-992578,2020-01-23,000001,Vente,20000,12,,RUE SAINT ROCH,0034,70160,70236,Fleurey-lès-Faverney,70,,,702360000D0735,,,,,,,,,,,,,0,,,,,AB,terrains a bâtir,,,874,6.082107,47.746018
2020-992922,2020-05-14,000001,Vente,224000,18,,RUE SAINT ROCH,0034,70160,70236,Fleurey-lès-Faverney,70,,,70236000ZB0173,,,,,,,,,,,,,0,1,Maison,131,5,S,sols,,,1038,6.079986,47.746081
2020-993152,2020-06-26,000001,Vente,200,1,B,RLE VINEY,0042,70160,70236,Fleurey-lès-Faverney,70,,,702360000D0419,,,2,18,,,,,,,,,1,3,Dépendance,,0,,,,,,6.089017,47.743576
2020-993364,2020-07-20,000001,Vente,500,,,VIGNES MONTANT 2EME CANTON,B135,70160,70236,Fleurey-lès-Faverney,70,,,702360000A0633,,,,,,,,,,,,,0,,,,,T,terres,,,936,6.087515,47.748526
2020-993364,2020-07-20,000001,Vente,500,,,VIGNES MONTANT 2EME CANTON,B135,70160,70236,Fleurey-lès-Faverney,70,,,702360000A0634,,,,,,,,,,,,,0,,,,,T,terres,,,500,6.087603,47.748592
2020-993364,2020-07-20,000001,Vente,500,,,VIGNES MONTANT 2EME CANTON,B135,70160,70236,Fleurey-lès-Faverney,70,,,702360000A0824,,,,,,,,,,,,,0,,,,,T,terres,,,937,6.087507,47.748367
2020-994083,2020-11-09,000001,Vente,175000,9,,RUE DE LA FONTAINE LEGE,0018,70160,70236,Fleurey-lès-Faverney,70,,,702360000D0650,,,,,,,,,,,,,0,1,Maison,60,3,S,sols,,,619,6.087475,47.746222
2020-994083,2020-11-09,000001,Vente,175000,,,ENTRE LES DEUX VOIES 2E CA,B060,70160,70236,Fleurey-lès-Faverney,70,,,702360000D0654,,,,,,,,,,,,,0,,,,,T,terres,,,117,6.087665,47.746138
2020-994083,2020-11-09,000001,Vente,175000,,,ENTRE LES DEUX VOIES 2E CA,B060,70160,70236,Fleurey-lès-Faverney,70,,,702360000D0658,,,,,,,,,,,,,0,,,,,T,terres,,,122,6.087724,47.746121
2020-994083,2020-11-09,000001,Vente,175000,,,ENTRE LES DEUX VOIES 2E CA,B060,70160,70236,Fleurey-lès-Faverney,70,,,702360000D0662,,,,,,,,,,,,,0,,,,,T,terres,,,166,6.087807,47.746085
2020-994083,2020-11-09,000001,Vente,175000,,,ENTRE LES DEUX VOIES 2E CA,B060,70160,70236,Fleurey-lès-Faverney,70,,,702360000D0685,,,,,,,,,,,,,0,,,,,T,terres,,,116,6.087593,47.746366
2020-994083,2020-11-09,000001,Vente,175000,,,ENTRE LES DEUX VOIES 2E CA,B060,70160,70236,Fleurey-lès-Faverney,70,,,702360000D0687,,,,,,,,,,,,,0,,,,,T,terres,,,24,6.087778,47.746287
2020-994083,2020-11-09,000001,Vente,175000,,,ENTRE LES DEUX VOIES 2E CA,B060,70160,70236,Fleurey-lès-Faverney,70,,,702360000D0689,,,,,,,,,,,,,0,,,,,T,terres,,,25,6.087832,47.746268
2020-994083,2020-11-09,000001,Vente,175000,,,ENTRE LES DEUX VOIES 2E CA,B060,70160,70236,Fleurey-lès-Faverney,70,,,702360000D0691,,,,,,,,,,,,,0,,,,,T,terres,,,35,6.087897,47.746244
2020-994200,2020-11-27,000001,Vente,776,,,VIGNES GIRARDEY,B132,70160,70236,Fleurey-lès-Faverney,70,,,702360000D0038,,,,,,,,,,,,,0,,,,,VE,vergers,,,194,6.081865,47.744405
2020-994314,2020-12-15,000001,Vente,1,,,LE VILLAGE,B136,70160,70236,Fleurey-lès-Faverney,70,,,702360000D0215,,,,,,,,,,,,,0,,,,,S,sols,,,440,6.088344,47.744951
