id_mutation,date_mutation,numero_disposition,nature_mutation,valeur_fonciere,adresse_numero,adresse_suffixe,adresse_nom_voie,adresse_code_voie,code_postal,code_commune,nom_commune,code_departement,ancien_code_commune,ancien_nom_commune,id_parcelle,ancien_id_parcelle,numero_volume,lot1_numero,lot1_surface_carrez,lot2_numero,lot2_surface_carrez,lot3_numero,lot3_surface_carrez,lot4_numero,lot4_surface_carrez,lot5_numero,lot5_surface_carrez,nombre_lots,code_type_local,type_local,surface_reelle_bati,nombre_pieces_principales,code_nature_culture,nature_culture,code_nature_culture_speciale,nature_culture_speciale,surface_terrain,longitude,latitude
2020-994612,2020-03-12,000001,Vente,346.2,,,DERRIERE VETOUE,B053,70120,70237,Fleurey-lès-Lavoncourt,70,,,702370000A0215,,,,,,,,,,,,,0,,,,,BT,taillis simples,,,1154,5.776578,47.669337
2020-994736,2020-05-22,000001,Vente,40000,3,,IMP DE LA VANOISE,0095,70120,70237,Fleurey-lès-Lavoncourt,70,,,702370000D0071,,,,,,,,,,,,,0,1,Maison,88,3,S,sols,,,426,5.781161,47.658265
2020-994778,2020-06-04,000001,Vente,1000,,,AUX COMBES,B036,70120,70237,Fleurey-lès-Lavoncourt,70,,,702370000B0756,,,,,,,,,,,,,0,,,,,BT,taillis simples,,,6600,5.802368,47.66436
2020-994810,2020-06-06,000001,Vente,150000,7,,RTE DE RENAUCOURT,0090,70120,70237,Fleurey-lès-Lavoncourt,70,,,702370000D0213,,,,,,,,,,,,,0,1,Maison,210,6,S,sols,,,1076,5.784702,47.658481
2020-994810,2020-06-06,000001,Vente,150000,7,,RTE DE RENAUCOURT,0090,70120,70237,Fleurey-lès-Lavoncourt,70,,,702370000D0213,,,,,,,,,,,,,0,1,Maison,71,2,S,sols,,,1076,5.784702,47.658481
2020-994810,2020-06-06,000001,Vente,150000,,,LE VILLAGE,B136,70120,70237,Fleurey-lès-Lavoncourt,70,,,702370000D0214,,,,,,,,,,,,,0,,,,,J,jardins,,,440,5.784486,47.658372
2020-994810,2020-06-06,000001,Vente,150000,,,LE VILLAGE,B136,70120,70237,Fleurey-lès-Lavoncourt,70,,,702370000D0215,,,,,,,,,,,,,0,,,,,P,prés,,,520,5.784431,47.658211
2020-994810,2020-06-06,000001,Vente,150000,,,LE VILLAGE,B136,70120,70237,Fleurey-lès-Lavoncourt,70,,,702370000D0880,,,,,,,,,,,,,0,,,,,P,prés,,,337,5.784637,47.658179
