id_mutation,date_mutation,numero_disposition,nature_mutation,valeur_fonciere,adresse_numero,adresse_suffixe,adresse_nom_voie,adresse_code_voie,code_postal,code_commune,nom_commune,code_departement,ancien_code_commune,ancien_nom_commune,id_parcelle,ancien_id_parcelle,numero_volume,lot1_numero,lot1_surface_carrez,lot2_numero,lot2_surface_carrez,lot3_numero,lot3_surface_carrez,lot4_numero,lot4_surface_carrez,lot5_numero,lot5_surface_carrez,nombre_lots,code_type_local,type_local,surface_reelle_bati,nombre_pieces_principales,code_nature_culture,nature_culture,code_nature_culture_speciale,nature_culture_speciale,surface_terrain,longitude,latitude
2020-994662,2020-04-21,000001,Vente,29500,10,,RUE DES CHEVAUX,0035,70600,70406,Percey-le-Grand,70,,,70406000AB0261,,,,,,,,,,,,,0,1,Maison,150,6,S,sols,,,1249,5.39044,47.608584
2020-994670,2020-04-30,000002,Vente,393.32,,,LE VILLAGE,B063,70600,70406,Percey-le-Grand,70,,,70406000AB0248,,,,,,,,,,,,,0,,,,,J,jardins,,,258,,
2020-994773,2020-06-02,000001,Vente,17000,17,,RUE DU CHATEAU,0033,70600,70406,Percey-le-Grand,70,,,70406000AB0015,,,,,,,,,,,,,0,1,Maison,64,2,S,sols,,,913,5.386532,47.610517
2020-994773,2020-06-02,000001,Vente,17000,,,LE VILLAGE,B063,70600,70406,Percey-le-Grand,70,,,70406000AB0016,,,,,,,,,,,,,0,,,,,VI,vignes,,,1399,5.386605,47.61104
2020-994773,2020-06-02,000001,Vente,17000,,,LE VILLAGE,B063,70600,70406,Percey-le-Grand,70,,,70406000AB0017,,,,,,,,,,,,,0,,,,,J,jardins,,,1560,5.386694,47.610867
2020-994917,2020-07-13,000001,Vente,200,,,LE VILLAGE,B063,70600,70406,Percey-le-Grand,70,,,70406000AB0116,,,,,,,,,,,,,0,,,,,J,jardins,,,255,5.390251,47.607888
2020-994975,2020-07-20,000001,Vente,2250,,,SUR LA VIGNE DE LA COUR,B062,70600,70406,Percey-le-Grand,70,,,70406000ZL0056,,,,,,,,,,,,,0,,,,,T,terres,,,3010,5.379188,47.610861
2020-994975,2020-07-20,000001,Vente,2250,,,SUR LA VIGNE DE LA COUR,B062,70600,70406,Percey-le-Grand,70,,,70406000ZL0056,,,,,,,,,,,,,0,,,,,T,terres,,,3010,5.379188,47.610861
2020-994975,2020-07-20,000001,Vente,2250,,,SUR LA VIGNE DE LA COUR,B062,70600,70406,Percey-le-Grand,70,,,70406000ZL0057,,,,,,,,,,,,,0,,,,,T,terres,,,3000,5.379597,47.611122
2020-995023,2020-08-11,000001,Vente,7500,,,LE VILLAGE,B063,70600,70406,Percey-le-Grand,70,,,70406000AB0263,,,,,,,,,,,,,0,,,,,T,terres,,,1711,5.38639,47.609865
2020-995033,2020-08-31,000001,Vente,4500,2,,RUE DU CHATEAU,0033,70600,70406,Percey-le-Grand,70,,,70406000AB0036,,,,,,,,,,,,,0,1,Maison,40,1,S,sols,,,370,5.388343,47.609582
2020-995183,2020-10-08,000001,Vente,53500,2,,PL DE L EGLISE,0053,70600,70406,Percey-le-Grand,70,,,70406000AB0046,,,,,,,,,,,,,0,1,Maison,103,4,S,sols,,,422,5.389314,47.609765
2020-995327,2020-11-04,000001,Vente,6000,2,,RTE D'ORAIN,0140,70600,70406,Percey-le-Grand,70,,,70406000AB0078,,,,,,,,,,,,,0,1,Maison,84,4,S,sols,,,277,5.389778,47.609667
2020-995403,2020-11-26,000001,Vente,10550,,,COMBE AU RAVEAU,B024,70600,70406,Percey-le-Grand,70,,,70406000ZD0019,,,,,,,,,,,,,0,,,,,T,terres,,,29950,5.409863,47.627174
2020-995403,2020-11-26,000001,Vente,10550,,,COMBE AU RAVEAU,B024,70600,70406,Percey-le-Grand,70,,,70406000ZD0019,,,,,,,,,,,,,0,,,,,T,terres,,,12250,5.409863,47.627174
2020-995465,2020-12-15,000001,Vente,65000,,,LE VILLAGE,B063,70600,70406,Percey-le-Grand,70,,,70406000AB0039,,,,,,,,,,,,,0,,,,,T,terres,,,1298,5.388775,47.610641
2020-995465,2020-12-15,000001,Vente,65000,,,LE VILLAGE,B063,70600,70406,Percey-le-Grand,70,,,70406000AB0040,,,,,,,,,,,,,0,,,,,J,jardins,,,897,5.388473,47.610114
2020-995465,2020-12-15,000001,Vente,65000,5,,RUE DU CHATEAU,0033,70600,70406,Percey-le-Grand,70,,,70406000AB0041,,,,,,,,,,,,,0,1,Maison,67,2,S,sols,,,993,5.388378,47.609956
2020-995465,2020-12-15,000001,Vente,65000,,,AU DESSUS DU VILLAGE,B032,70600,70406,Percey-le-Grand,70,,,70406000ZK0010,,,,,,,,,,,,,0,,,,,T,terres,,,1340,5.389032,47.611371
2020-995523,2020-12-16,000001,Vente,72000,1,,RTE D'ORAIN,0140,70600,70406,Percey-le-Grand,70,,,70406000AB0144,,,,,,,,,,,,,0,1,Maison,100,3,S,sols,,,425,5.389965,47.609328
