id_mutation,date_mutation,numero_disposition,nature_mutation,valeur_fonciere,adresse_numero,adresse_suffixe,adresse_nom_voie,adresse_code_voie,code_postal,code_commune,nom_commune,code_departement,ancien_code_commune,ancien_nom_commune,id_parcelle,ancien_id_parcelle,numero_volume,lot1_numero,lot1_surface_carrez,lot2_numero,lot2_surface_carrez,lot3_numero,lot3_surface_carrez,lot4_numero,lot4_surface_carrez,lot5_numero,lot5_surface_carrez,nombre_lots,code_type_local,type_local,surface_reelle_bati,nombre_pieces_principales,code_nature_culture,nature_culture,code_nature_culture_speciale,nature_culture_speciale,surface_terrain,longitude,latitude
2020-994884,2020-07-02,000001,Vente,93000,48,,RUE DE LA FONTAINE,0068,70140,70444,La Résie-Saint-Martin,70,,,704440000A0843,,,,,,,,,,,,,0,1,Maison,56,1,S,sols,,,1076,5.609793,47.312562
2020-994884,2020-07-02,000001,Vente,93000,48,,RUE DE LA FONTAINE,0068,70140,70444,La Résie-Saint-Martin,70,,,704440000A0843,,,,,,,,,,,,,0,3,Dépendance,,0,S,sols,,,1076,5.609793,47.312562
2020-994894,2020-06-26,000001,Vente,6100,,,LES VIGNOTTES,B021,70140,70444,La Résie-Saint-Martin,70,,,70444000ZC0011,,,,,,,,,,,,,0,,,,,T,terres,,,4950,5.615388,47.308045
2020-994894,2020-06-26,000001,Vente,6100,,,LES VIGNOTTES,B021,70140,70444,La Résie-Saint-Martin,70,,,70444000ZC0011,,,,,,,,,,,,,0,,,,,T,terres,,,9900,5.615388,47.308045
2020-995453,2020-12-04,000001,Vente,120000,,,LE VILLAGE,B022,70140,70444,La Résie-Saint-Martin,70,,,704440000A0697,,,,,,,,,,,,,0,,,,,P,prés,,,490,5.608745,47.31315
2020-995453,2020-12-04,000001,Vente,120000,,,LE VILLAGE,B022,70140,70444,La Résie-Saint-Martin,70,,,704440000A0808,,,,,,,,,,,,,0,,,,,J,jardins,,,720,5.608889,47.31305
2020-995453,2020-12-04,000001,Vente,120000,,,LE VILLAGE,B022,70140,70444,La Résie-Saint-Martin,70,,,704440000A0854,,,,,,,,,,,,,0,,,,,S,sols,,,19,5.608943,47.313153
2020-995453,2020-12-04,000001,Vente,120000,5024,,RUE DE LA FONTAINE,0068,70140,70444,La Résie-Saint-Martin,70,,,704440000A0855,,,,,,,,,,,,,0,1,Maison,110,3,S,sols,,,827,5.608458,47.313003
