id_mutation,date_mutation,numero_disposition,nature_mutation,valeur_fonciere,adresse_numero,adresse_suffixe,adresse_nom_voie,adresse_code_voie,code_postal,code_commune,nom_commune,code_departement,ancien_code_commune,ancien_nom_commune,id_parcelle,ancien_id_parcelle,numero_volume,lot1_numero,lot1_surface_carrez,lot2_numero,lot2_surface_carrez,lot3_numero,lot3_surface_carrez,lot4_numero,lot4_surface_carrez,lot5_numero,lot5_surface_carrez,nombre_lots,code_type_local,type_local,surface_reelle_bati,nombre_pieces_principales,code_nature_culture,nature_culture,code_nature_culture_speciale,nature_culture_speciale,surface_terrain,longitude,latitude
2020-998407,2020-01-04,000001,Vente,112000,2,,RUE DE LA CROIX BICHET,0081,71240,71249,Laives,71,,,71249000AC0106,,,,,,,,,,,,,0,1,Maison,90,2,S,sols,,,494,4.851764,46.647253
2020-998453,2020-01-21,000002,Vente,3018,,,EN THIOT,B150,71240,71249,Laives,71,,,71249000ZO0150,,,,,,,,,,,,,0,,,,,PA,pâtures,PATUR,Pâture plantée,1006,4.83782,46.645697
2020-998538,2020-01-25,000001,Vente,150000,,,LE BOURG,B012,71240,71249,Laives,71,,,71249000AE0400,,,,,,,,,,,,,0,,,,,P,prés,,,1877,4.837741,46.641054
2020-998538,2020-01-25,000001,Vente,150000,18,,RUE MOISSON,0025,71240,71249,Laives,71,,,71249000AE0402,,,,,,,,,,,,,0,1,Maison,148,4,S,sols,,,541,4.838049,46.641188
2020-998568,2020-01-31,000001,Vente,103500,15,,MTE DE LENOUX,0020,71240,71249,Laives,71,,,71249000AD0034,,,,,,,,,,,,,0,1,Maison,127,4,S,sols,,,1883,4.848692,46.644072
2020-998568,2020-01-31,000001,Vente,103500,,,LENOUX,B080,71240,71249,Laives,71,,,71249000AD0415,,,,,,,,,,,,,0,,,,,S,sols,,,921,4.848485,46.643823
2020-998916,2020-02-12,000001,Vente,1500,,,EN ROSIER,B135,71240,71249,Laives,71,,,71249000ZP0063,,,,,,,,,,,,,0,,,,,T,terres,,,860,4.834998,46.636987
2020-998951,2020-03-04,000001,Vente,228500,22,,RUE DE LA CROIX BICHET,0081,71240,71249,Laives,71,,,71249000ZN0115,,,,,,,,,,,,,0,1,Maison,146,4,S,sols,,,1000,4.850247,46.648952
2020-998951,2020-03-04,000001,Vente,228500,22,,RUE DE LA CROIX BICHET,0081,71240,71249,Laives,71,,,71249000ZN0115,,,,,,,,,,,,,0,1,Maison,146,4,AG,terrains d'agrément,,,1585,4.850247,46.648952
2020-999192,2020-03-23,000001,Vente,400,,,AUX RUCHETTES,B136,71240,71249,Laives,71,,,712490000C0043,,,,,,,,,,,,,0,,,,,T,terres,,,3368,4.850048,46.640182
2020-999598,2020-05-22,000001,Vente,150000,1,,MTE DE LA CROIX,0079,71240,71249,Laives,71,,,71249000ZO0019,,,,,,,,,,,,,0,1,Maison,80,3,S,sols,,,760,4.836732,46.647807
2020-999598,2020-05-22,000001,Vente,150000,1,,MTE DE LA CROIX,0079,71240,71249,Laives,71,,,71249000ZO0019,,,,,,,,,,,,,0,1,Maison,80,3,T,terres,,,3280,4.836732,46.647807
2020-999688,2020-06-04,000001,Vente,620,,,MONTAGNE DE SAINT BONNET,B090,71240,71249,Laives,71,,,712490000D0801,,,,,,,,,,,,,0,,,,,P,prés,,,159,4.840454,46.638937
2020-999688,2020-06-04,000001,Vente,620,,,MONTAGNE DE SAINT BONNET,B090,71240,71249,Laives,71,,,712490000D0802,,,,,,,,,,,,,0,,,,,P,prés,,,51,4.8407,46.639099
2020-999688,2020-06-04,000001,Vente,620,,,MONTAGNE DE SAINT BONNET,B090,71240,71249,Laives,71,,,712490000D0803,,,,,,,,,,,,,0,,,,,P,prés,,,38,4.840784,46.639123
2020-999691,2020-06-04,000001,Vente,57.5,,,MONTAGNE DE SAINT BONNET,B090,71240,71249,Laives,71,,,712490000D0799,,,,,,,,,,,,,0,,,,,P,prés,,,20,4.840807,46.639068
2020-999691,2020-06-04,000001,Vente,57.5,,,MONTAGNE DE SAINT BONNET,B090,71240,71249,Laives,71,,,712490000D0800,,,,,,,,,,,,,0,,,,,P,prés,,,3,4.840829,46.639096
2020-1000079,2020-07-03,000001,Vente,132000,,,LE BOURG,B012,71240,71249,Laives,71,,,71249000AE0115,,,,,,,,,,,,,0,,,,,J,jardins,,,734,4.837975,46.641504
2020-1000079,2020-07-03,000001,Vente,132000,18,,RUE DES FONTAINES,0015,71240,71249,Laives,71,,,71249000AE0116,,,,,,,,,,,,,0,1,Maison,72,3,S,sols,,,422,4.838143,46.64157
2020-1000108,2020-06-09,000001,Vente,51000,,,EN CHAILLOT,B023,71240,71249,Laives,71,,,712490000D0797,,,,,,,,,,,,,0,,,,,P,prés,,,17,4.841127,46.639051
2020-1000108,2020-06-09,000001,Vente,51000,,,MONTAGNE DE SAINT BONNET,B090,71240,71249,Laives,71,,,712490000D0800,,,,,,,,,,,,,0,,,,,P,prés,,,3,4.840829,46.639096
2020-1000108,2020-06-09,000001,Vente,51000,,,MONTAGNE DE SAINT BONNET,B090,71240,71249,Laives,71,,,712490000D0803,,,,,,,,,,,,,0,,,,,P,prés,,,38,4.840784,46.639123
2020-1000108,2020-06-09,000001,Vente,51000,,,EN CHAILLOT,B023,71240,71249,Laives,71,,,712490000D0805,,,,,,,,,,,,,0,,,,,P,prés,,,95,4.841245,46.639047
2020-1000108,2020-06-09,000001,Vente,51000,,,EN CHAILLOT,B023,71240,71249,Laives,71,,,712490000D0807,,,,,,,,,,,,,0,,,,,P,prés,,,363,4.840974,46.639121
2020-1000108,2020-06-09,000001,Vente,51000,,,MONTAGNE DE SAINT BONNET,B090,71240,71249,Laives,71,,,712490000D0809,,,,,,,,,,,,,0,,,,,P,prés,,,155,4.840815,46.63921
2020-1000108,2020-06-09,000001,Vente,51000,,,EN CHAILLOT,B023,71240,71249,Laives,71,,,712490000D0810,,,,,,,,,,,,,0,,,,,P,prés,,,71,4.84108,46.639188
2020-1000108,2020-06-09,000001,Vente,51000,,,EN CHAILLOT,B023,71240,71249,Laives,71,,,712490000D0811,,,,,,,,,,,,,0,,,,,P,prés,,,191,4.841156,46.639142
2020-1000108,2020-06-09,000001,Vente,51000,,,EN CHAILLOT,B023,71240,71249,Laives,71,,,712490000D0812,,,,,,,,,,,,,0,,,,,P,prés,,,94,4.841307,46.639137
2020-1000206,2020-07-15,000001,Vente,400,,,LE CLOS VARIAUX,B044,71240,71249,Laives,71,,,71249000AE0086,,,,,,,,,,,,,0,,,,,J,jardins,,,475,4.839591,46.641018
2020-1000669,2020-08-25,000001,Vente,144050,,,SERMAISEY,B142,71240,71249,Laives,71,,,71249000AC0132,,,,,,,,,,,,,0,,,,,S,sols,,,107,4.852414,46.646236
2020-1000669,2020-08-25,000001,Vente,144050,35,,RUE DE SERMAISEY,0295,71240,71249,Laives,71,,,71249000AC0136,,,,,,,,,,,,,0,1,Maison,90,4,S,sols,,,260,4.852331,46.646133
2020-1000669,2020-08-25,000001,Vente,144050,,,SERMAISEY,B142,71240,71249,Laives,71,,,71249000AC0267,,,,,,,,,,,,,0,,,,,S,sols,,,35,4.852464,46.646117
2020-1000669,2020-08-25,000001,Vente,144050,,,LE MEIX DANEAUX,B083,71240,71249,Laives,71,,,71249000AC0307,,,,,,,,,,,,,0,,,,,P,prés,,,535,4.852411,46.646045
2020-1000844,2020-09-08,000001,Vente,652,,,LE CLOS DE LOISE,B042,71240,71249,Laives,71,,,71249000AB0156,,,,,,,,,,,,,0,,,,,VI,vignes,VAOC,Vins d'appellation d'origine contrôlée,793,4.853867,46.643338
2020-1000844,2020-09-08,000001,Vente,652,,,LE CLOS DE LOISE,B042,71240,71249,Laives,71,,,71249000AB0170,,,,,,,,,,,,,0,,,,,VI,vignes,,,1518,4.852627,46.643902
2020-1000844,2020-09-08,000001,Vente,652,,,AUX BORDES,B011,71240,71249,Laives,71,,,712490000C0253,,,,,,,,,,,,,0,,,,,L,landes,FRICH,Friche,1440,4.85042,46.634453
2020-1000844,2020-09-08,000001,Vente,652,,,AUX TREMPLIERES,B151,71240,71249,Laives,71,,,712490000C0275,,,,,,,,,,,,,0,,,,,L,landes,FRICH,Friche,600,4.849829,46.637127
2020-1000852,2020-09-08,000001,Vente,270,,,LE CHAMP DURAND,B030,71240,71249,Laives,71,,,712490000C0114,,,,,,,,,,,,,0,,,,,VI,vignes,VAOC,Vins d'appellation d'origine contrôlée,542,4.852928,46.642088
2020-1000852,2020-09-08,000001,Vente,270,,,LE CHAMP DURAND,B030,71240,71249,Laives,71,,,712490000C0114,,,,,,,,,,,,,0,,,,,VI,vignes,,,1085,4.852928,46.642088
2020-1000913,2020-07-20,000001,Vente,300,,,POIRIER BALLOT,B116,71240,71249,Laives,71,,,71249000ZP0116,,,,,,,,,,,,,0,,,,,T,terres,,,600,4.823338,46.639125
2020-1000987,2020-09-23,000001,Vente,245000,1,,RUE LA RUEE,0275,71240,71249,Laives,71,,,71249000AD0168,,,,,,,,,,,,,0,1,Maison,93,3,S,sols,,,1342,4.843912,46.644382
2020-1000987,2020-09-23,000001,Vente,245000,1,,RUE LA RUEE,0275,71240,71249,Laives,71,,,71249000AD0168,,,,,,,,,,,,,0,4,Local industriel. commercial ou assimilé,289,0,S,sols,,,1342,4.843912,46.644382
2020-1000987,2020-09-23,000001,Vente,245000,1,,RUE LA RUEE,0275,71240,71249,Laives,71,,,71249000AD0168,,,,,,,,,,,,,0,4,Local industriel. commercial ou assimilé,461,0,S,sols,,,1342,4.843912,46.644382
2020-1000988,2020-09-26,000001,Vente,2460,,,PRES CARRES,B124,71240,71249,Laives,71,,,71249000ZK0052,,,,,,,,,,,,,0,,,,,P,prés,,,8200,4.832859,46.662608
2020-1000988,2020-09-26,000001,Vente,2460,,,PRES CARRES,B124,71240,71249,Laives,71,,,71249000ZK0052,,,,,,,,,,,,,0,,,,,P,prés,,,16400,4.832859,46.662608
2020-1001039,2020-09-23,000001,Vente,140000,66,,RTE DE NANTON,0030,71240,71249,Laives,71,,,712490000D0784,,,,,,,,,,,,,0,1,Maison,80,4,S,sols,,,1000,4.833321,46.639334
2020-1001039,2020-09-23,000001,Vente,140000,66,,RTE DE NANTON,0030,71240,71249,Laives,71,,,712490000D0784,,,,,,,,,,,,,0,1,Maison,80,4,AG,terrains d'agrément,,,343,4.833321,46.639334
2020-1001039,2020-09-23,000001,Vente,140000,,,DERRIERE LA RUE TOURLAIN,B053,71240,71249,Laives,71,,,71249000ZP0198,,,,,,,,,,,,,0,,,,,T,terres,,,205,4.83319,46.63925
2020-1001787,2020-11-20,000001,Vente,1000,,,MONT GEILLARD,B087,71240,71249,Laives,71,,,712490000C0190,,,,,,,,,,,,,0,,,,,BT,taillis simples,ACACI,Acacias,370,4.850486,46.638498
2020-1001787,2020-11-20,000001,Vente,1000,,,MONT GEILLARD,B087,71240,71249,Laives,71,,,712490000C0191,,,,,,,,,,,,,0,,,,,VI,vignes,,,885,4.850478,46.638626
2020-1001787,2020-11-20,000001,Vente,1000,,,EN LA GOESE,B065,71240,71249,Laives,71,,,712490000C0217,,,,,,,,,,,,,0,,,,,L,landes,FRICH,Friche,410,4.849405,46.63789
2020-1001787,2020-11-20,000001,Vente,1000,,,EN LA GOESE,B065,71240,71249,Laives,71,,,712490000C0218,,,,,,,,,,,,,0,,,,,L,landes,FRICH,Friche,1450,4.849577,46.637776
2020-1001787,2020-11-20,000001,Vente,1000,,,AUX TREMPLIERES,B151,71240,71249,Laives,71,,,712490000C0276,,,,,,,,,,,,,0,,,,,L,landes,FRICH,Friche,750,4.850052,46.637371
2020-1001787,2020-11-20,000001,Vente,1000,,,AUX TREMPLIERES,B151,71240,71249,Laives,71,,,712490000C0277,,,,,,,,,,,,,0,,,,,L,landes,FRICH,Friche,290,4.850021,46.637559
2020-1001787,2020-11-20,000001,Vente,1000,,,CHAMP MOUSSON,B034,71240,71249,Laives,71,,,712490000D0317,,,,,,,,,,,,,0,,,,,L,landes,FRICH,Friche,3010,4.837417,46.63164
2020-1001787,2020-11-20,000001,Vente,1000,,,MONTAGNE DE FAILLE,B088,71240,71249,Laives,71,,,712490000D0465,,,,,,,,,,,,,0,,,,,L,landes,FRICH,Friche,500,4.84214,46.632361
2020-1001787,2020-11-20,000001,Vente,1000,,,MONTAGNE DE FAILLE,B088,71240,71249,Laives,71,,,712490000D0468,,,,,,,,,,,,,0,,,,,L,landes,FRICH,Friche,750,4.842294,46.631761
2020-1001787,2020-11-20,000001,Vente,1000,,,MONTAGNE DE FAILLE,B088,71240,71249,Laives,71,,,712490000D0470,,,,,,,,,,,,,0,,,,,L,landes,FRICH,Friche,450,4.841979,46.631734
2020-1001787,2020-11-20,000001,Vente,1000,,,EN CHARMOY,B037,71240,71249,Laives,71,,,712490000D0532,,,,,,,,,,,,,0,,,,,BT,taillis simples,ACACI,Acacias,360,4.840646,46.632875
2020-1001787,2020-11-20,000001,Vente,1000,,,EN CHARMOY,B037,71240,71249,Laives,71,,,712490000D0538,,,,,,,,,,,,,0,,,,,L,landes,FRICH,Friche,458,4.840147,46.632295
2020-1001787,2020-11-20,000001,Vente,1000,,,EN CHARMOY,B037,71240,71249,Laives,71,,,712490000D0539,,,,,,,,,,,,,0,,,,,BT,taillis simples,ACACI,Acacias,367,4.841174,46.631971
2020-1001787,2020-11-20,000001,Vente,1000,,,EN CHARMOY,B037,71240,71249,Laives,71,,,712490000D0540,,,,,,,,,,,,,0,,,,,L,landes,FRICH,Friche,940,4.840206,46.632191
2020-1001897,2020-11-05,000001,Vente,150000,5131,,MTE DE LENOUX,0020,71240,71249,Laives,71,,,71249000AD0095,,,,,,,,,,,,,0,3,Dépendance,,0,S,sols,,,23,4.846995,46.641307
2020-1001897,2020-11-05,000001,Vente,150000,5131,,MTE DE LENOUX,0020,71240,71249,Laives,71,,,71249000AD0095,,,,,,,,,,,,,0,3,Dépendance,,0,S,sols,,,23,4.846995,46.641307
2020-1001897,2020-11-05,000001,Vente,150000,5131,,MTE DE LENOUX,0020,71240,71249,Laives,71,,,71249000AD0095,,,,,,,,,,,,,0,1,Maison,136,3,S,sols,,,23,4.846995,46.641307
2020-1001897,2020-11-05,000001,Vente,150000,,,LENOUX,B080,71240,71249,Laives,71,,,71249000AD0096,,,,,,,,,,,,,0,,,,,J,jardins,,,621,4.847045,46.641142
2020-1001897,2020-11-05,000001,Vente,150000,35,,MTE DE LENOUX,0020,71240,71249,Laives,71,,,71249000AD0097,,,,,,,,,,,,,0,,,,,S,sols,,,294,4.847031,46.640937
2020-1001980,2020-12-08,000001,Vente,150000,5226,,RUE LA RONDE,0265,71240,71249,Laives,71,,,71249000AD0180,,,,,,,,,,,,,0,1,Maison,80,4,S,sols,,,1219,4.842155,46.643357
2020-1001980,2020-12-08,000001,Vente,150000,,,LA RUEE,B138,71240,71249,Laives,71,,,71249000AD0181,,,,,,,,,,,,,0,,,,,P,prés,,,1817,4.841196,46.644001
2020-1002195,2020-12-08,000001,Vente,107000,,,LENOUX,B080,71240,71249,Laives,71,,,71249000AD0085,,,,,,,,,,,,,0,,,,,S,sols,,,998,4.847785,46.641497
2020-1002195,2020-12-08,000001,Vente,107000,2,,IMP DES ANTONINS,0045,71240,71249,Laives,71,,,71249000AD0087,,,,,,,,,,,,,0,1,Maison,100,4,S,sols,,,137,4.847891,46.641454
