id_mutation,date_mutation,numero_disposition,nature_mutation,valeur_fonciere,adresse_numero,adresse_suffixe,adresse_nom_voie,adresse_code_voie,code_postal,code_commune,nom_commune,code_departement,ancien_code_commune,ancien_nom_commune,id_parcelle,ancien_id_parcelle,numero_volume,lot1_numero,lot1_surface_carrez,lot2_numero,lot2_surface_carrez,lot3_numero,lot3_surface_carrez,lot4_numero,lot4_surface_carrez,lot5_numero,lot5_surface_carrez,nombre_lots,code_type_local,type_local,surface_reelle_bati,nombre_pieces_principales,code_nature_culture,nature_culture,code_nature_culture_speciale,nature_culture_speciale,surface_terrain,longitude,latitude
2020-1004887,2020-01-30,000001,Vente,98000,5176,,LAVAULT,B147,71190,71297,Mesvres,71,,,712970000E0253,,,,,,,,,,,,,0,1,Maison,240,8,S,sols,,,1474,4.231118,46.854177
2020-1004887,2020-01-30,000001,Vente,98000,,,LAVAULT,B147,71190,71297,Mesvres,71,,,712970000E0254,,,,,,,,,,,,,0,,,,,BS,taillis sous futaie,,,1454,4.231188,46.854551
2020-1004887,2020-01-30,000001,Vente,98000,,,LAVAULT,B147,71190,71297,Mesvres,71,,,712970000E0255,,,,,,,,,,,,,0,,,,,J,jardins,,,500,4.230766,46.854385
2020-1004978,2020-01-31,000001,Vente,47030,9,,GR GRANDE RUE,0320,71190,71297,Mesvres,71,,,71297000AB0038,,,,,,,,,,,,,0,1,Maison,78,4,S,sols,,,85,4.241449,46.862299
2020-1005086,2020-02-28,000001,Vente,38000,12,,GR GRANDE RUE,0320,71190,71297,Mesvres,71,,,71297000AB0224,,,,,,,,,,,,,0,1,Maison,55,3,S,sols,,,129,4.241682,46.861858
2020-1005169,2020-03-13,000001,Vente,20000,5205,,LA THIVELET,B146,71190,71297,Mesvres,71,,,712970000F0414,,,,,,,,,,,,,0,3,Dépendance,,0,T,terres,,,1538,4.241313,46.875346
2020-1005169,2020-03-13,000001,Vente,20000,5205,,LA THIVELET,B146,71190,71297,Mesvres,71,,,712970000F0414,,,,,,,,,,,,,0,1,Maison,50,1,T,terres,,,1538,4.241313,46.875346
2020-1005169,2020-03-13,000001,Vente,20000,5205,,LA THIVELET,B146,71190,71297,Mesvres,71,,,712970000F0414,,,,,,,,,,,,,0,1,Maison,50,1,S,sols,,,157,4.241313,46.875346
2020-1005169,2020-03-13,000001,Vente,20000,5205,,LA THIVELET,B146,71190,71297,Mesvres,71,,,712970000F0414,,,,,,,,,,,,,0,3,Dépendance,,0,S,sols,,,157,4.241313,46.875346
2020-1005219,2020-04-07,000001,Vente,1500,,,LE FORET,B120,71190,71297,Mesvres,71,,,712970000A0031,,,,,,,,,,,,,0,,,,,T,terres,,,8000,4.259953,46.896581
2020-1005219,2020-04-07,000001,Vente,1500,,,LE FORET,B120,71190,71297,Mesvres,71,,,712970000A0031,,,,,,,,,,,,,0,,,,,L,landes,FRICH,Friche,1450,4.259953,46.896581
2020-1005235,2020-04-01,000001,Vente,10860,,,LE CLAUZEAU,B096,71190,71297,Mesvres,71,,,712970000C0039,,,,,,,,,,,,,0,,,,,P,prés,,,2110,4.252908,46.851382
2020-1005235,2020-04-01,000001,Vente,10860,,,PRE BRENOT,B228,71190,71297,Mesvres,71,,,712970000C0040,,,,,,,,,,,,,0,,,,,P,prés,,,11885,4.252203,46.851086
2020-1005235,2020-04-01,000001,Vente,10860,,,LE CLAUZEAU,B096,71190,71297,Mesvres,71,,,712970000C0142,,,,,,,,,,,,,0,,,,,P,prés,,,4714,4.252067,46.851868
2020-1005308,2020-05-29,000001,Vente,39000,,,VALVIN,B289,71190,71297,Mesvres,71,,,712970000B0246,,,,,,,,,,,,,0,,,,,S,sols,,,1250,4.278312,46.872979
2020-1005308,2020-05-29,000001,Vente,39000,5103,,VALVIN,B289,71190,71297,Mesvres,71,,,712970000B0247,,,,,,,,,,,,,0,1,Maison,162,4,S,sols,,,379,4.278536,46.873151
2020-1005308,2020-05-29,000001,Vente,39000,,,VALVIN,B289,71190,71297,Mesvres,71,,,712970000B0248,,,,,,,,,,,,,0,,,,,P,prés,,,1401,4.278587,46.873348
2020-1005308,2020-05-29,000001,Vente,39000,,,VALVIN,B289,71190,71297,Mesvres,71,,,712970000B0260,,,,,,,,,,,,,0,,,,,T,terres,,,1450,4.278763,46.872825
2020-1005308,2020-05-29,000001,Vente,39000,,,VALVIN,B289,71190,71297,Mesvres,71,,,712970000B0261,,,,,,,,,,,,,0,,,,,T,terres,,,2482,4.278447,46.872489
2020-1005308,2020-05-29,000001,Vente,39000,,,VALVIN,B289,71190,71297,Mesvres,71,,,712970000B0405,,,,,,,,,,,,,0,,,,,J,jardins,,,1153,4.278939,46.873239
2020-1005395,2020-05-29,000001,Vente,400000,,,LES DOMAS,B114,71190,71297,Mesvres,71,,,712970000C0108,,,,,,,,,,,,,0,,,,,J,jardins,,,808,4.263295,46.84493
2020-1005395,2020-05-29,000001,Vente,400000,,,LES DOMAS,B114,71190,71297,Mesvres,71,,,712970000C0109,,,,,,,,,,,,,0,,,,,BS,taillis sous futaie,,,9300,4.262431,46.845177
2020-1005395,2020-05-29,000001,Vente,400000,,,LES DOMAS,B114,71190,71297,Mesvres,71,,,712970000C0110,,,,,,,,,,,,,0,,,,,T,terres,,,6766,4.261899,46.845098
2020-1005395,2020-05-29,000001,Vente,400000,,,LES DOMAS,B114,71190,71297,Mesvres,71,,,712970000C0111,,,,,,,,,,,,,0,,,,,T,terres,,,1237,4.262122,46.844778
2020-1005395,2020-05-29,000001,Vente,400000,5114,,LES DOMAS,B114,71190,71297,Mesvres,71,,,712970000C0141,,,,,,,,,,,,,0,1,Maison,400,10,S,sols,,,1303,4.263014,46.845148
2020-1005395,2020-05-29,000001,Vente,400000,5417,,LES DOMAS,B114,71190,71297,Mesvres,71,,,712970000C0161,,,,,,,,,,,,,0,3,Dépendance,,0,S,sols,,,1406,4.263358,46.845356
2020-1005456,2020-05-28,000001,Vente,27500,,,L OUCHE,B168,71190,71297,Mesvres,71,,,712970000F0307,,,,,,,,,,,,,0,,,,,P,prés,,,4240,4.253101,46.892551
2020-1005601,2020-05-22,000001,Vente,117000,14,,GR GRANDE RUE,0320,71190,71297,Mesvres,71,,,71297000AB0141,,,,,,,,,,,,,0,1,Maison,115,6,S,sols,,,237,4.241752,46.86178
2020-1005678,2020-07-17,000001,Vente,47000,25,,RUE DU CHAMP DE LA GARE,0313,71190,71297,Mesvres,71,,,71297000AC0117,,,,,,,,,,,,,0,1,Maison,62,4,S,sols,,,756,4.243888,46.864424
2020-1005686,2020-07-28,000001,Vente,32292,16,,RUE DE L'OUCHE TIROUX,0345,71190,71297,Mesvres,71,,,71297000AB0396,,,,,,,,,,,,,0,,,,,AB,terrains a bâtir,,,1196,4.237516,46.862276
2020-1005782,2020-08-14,000001,Vente,70000,31,,RUE DU CHAMP DE LA GARE,0313,71190,71297,Mesvres,71,,,71297000AC0121,,,,,,,,,,,,,0,1,Maison,87,6,S,sols,,,805,4.244761,46.864128
2020-1005967,2020-09-14,000001,Vente,1000,,,BOIS DE CHAMP ROND,B014,71190,71297,Mesvres,71,,,712970000B0097,,,,,,,,,,,,,0,,,,,BT,taillis simples,,,11340,4.252515,46.879233
2020-1005969,2020-09-14,000001,Vente,1000,,,PRE DES SAUGES,B240,71190,71297,Mesvres,71,,,712970000F0333,,,,,,,,,,,,,0,,,,,P,prés,,,8510,4.254403,46.881274
2020-1005982,2020-09-22,000001,Vente,24192,22,,RUE DE L'OUCHE TIROUX,0345,71190,71297,Mesvres,71,,,71297000AB0393,,,,,,,,,,,,,0,,,,,AB,terrains a bâtir,,,896,4.238644,46.862114
2020-1006121,2020-10-27,000001,Vente,900,,,LE BOURG,B031,71190,71297,Mesvres,71,,,71297000AB0132,,,,,,,,,,,,,0,,,,,J,jardins,,,90,4.241889,46.861224
2020-1006181,2020-10-22,000001,Vente,26217,17,,RUE DE L'OUCHE TIROUX,0345,71190,71297,Mesvres,71,,,71297000AB0397,,,,,,,,,,,,,0,,,,,AB,terrains a bâtir,,,971,4.237834,46.862487
2020-1006207,2020-10-28,000001,Vente,95000,,,LE BOURG,B031,71190,71297,Mesvres,71,,,71297000AB0108,,,,,,,,,,,,,0,,,,,P,prés,,,3286,4.243748,46.860581
2020-1006207,2020-10-28,000001,Vente,95000,26,,GR GRANDE RUE,0320,71190,71297,Mesvres,71,,,71297000AB0110,,,,,,,,,,,,,0,1,Maison,96,4,S,sols,,,775,4.243589,46.860887
2020-1006207,2020-10-28,000001,Vente,95000,,,LE BOURG,B031,71190,71297,Mesvres,71,,,71297000AB0274,,,,,,,,,,,,,0,,,,,J,jardins,,,200,4.24317,46.860546
2020-1006207,2020-10-28,000001,Vente,95000,,,LE BOURG,B031,71190,71297,Mesvres,71,,,71297000AB0275,,,,,,,,,,,,,0,,,,,J,jardins,,,176,4.243362,46.860832
2020-1006207,2020-10-28,000001,Vente,95000,,,LE BOURG,B031,71190,71297,Mesvres,71,,,71297000AB0377,,,,,,,,,,,,,0,,,,,T,terres,,,1244,4.242946,46.860503
2020-1006261,2020-11-26,000001,Vente,145000,2,B,IMP DES PRES,0326,71190,71297,Mesvres,71,,,71297000AC0280,,,,,,,,,,,,,0,1,Maison,103,5,S,sols,,,500,4.246003,46.863771
2020-1006261,2020-11-26,000001,Vente,145000,2,B,IMP DES PRES,0326,71190,71297,Mesvres,71,,,71297000AC0280,,,,,,,,,,,,,0,1,Maison,103,5,J,jardins,,,421,4.246003,46.863771
2020-1006267,2020-11-26,000001,Vente,92000,30,,RTE D AUTUN,0311,71190,71297,Mesvres,71,,,712970000B0446,,,,,,,,,,,,,0,1,Maison,110,5,J,jardins,,,1088,4.242697,46.872264
2020-1006267,2020-11-26,000001,Vente,92000,30,,RTE D AUTUN,0311,71190,71297,Mesvres,71,,,712970000B0446,,,,,,,,,,,,,0,1,Maison,110,5,S,sols,,,742,4.242697,46.872264
2020-1006268,2020-11-26,000001,Vente,342000,12,,RTE DE LA CHAPELLE,0314,71190,71297,Mesvres,71,,,712970000E0703,,,,,,,,,,,,,0,1,Maison,184,4,J,jardins,,,4110,4.242211,46.852608
2020-1006268,2020-11-26,000001,Vente,342000,12,,RTE DE LA CHAPELLE,0314,71190,71297,Mesvres,71,,,712970000E0703,,,,,,,,,,,,,0,1,Maison,184,4,S,sols,,,500,4.242211,46.852608
2020-1006304,2020-11-06,000001,Vente,11345,,,LE BOURG,B031,71190,71297,Mesvres,71,,,71297000AB0057,,,,,,,,,,,,,0,,,,,J,jardins,,,978,,
2020-1006404,2020-12-21,000001,Vente,56000,,,CHAMP ROND,B080,71190,71297,Mesvres,71,,,712970000B0053,,,,,,,,,,,,,0,,,,,T,terres,,,1870,4.247476,46.880436
2020-1006404,2020-12-21,000001,Vente,56000,,,CHAMP ROND,B080,71190,71297,Mesvres,71,,,712970000B0059,,,,,,,,,,,,,0,,,,,T,terres,,,4660,4.248189,46.879718
2020-1006404,2020-12-21,000001,Vente,56000,,,CHAMP ROND,B080,71190,71297,Mesvres,71,,,712970000B0060,,,,,,,,,,,,,0,,,,,T,terres,,,5688,4.248651,46.880043
2020-1006404,2020-12-21,000001,Vente,56000,,,CHAMP ROND,B080,71190,71297,Mesvres,71,,,712970000B0061,,,,,,,,,,,,,0,,,,,T,terres,,,6066,4.249687,46.880385
2020-1006404,2020-12-21,000001,Vente,56000,,,CHAMP ROND,B080,71190,71297,Mesvres,71,,,712970000B0061,,,,,,,,,,,,,0,,,,,T,terres,,,12132,4.249687,46.880385
2020-1006404,2020-12-21,000001,Vente,56000,,,CHAMP ROND,B080,71190,71297,Mesvres,71,,,712970000F0429,,,,,,,,,,,,,0,,,,,S,sols,,,2880,4.24672,46.88388
2020-1006407,2020-12-21,000001,Vente,50000,,,CHAMP ROND,B080,71190,71297,Mesvres,71,,,712970000F0335,,,,,,,,,,,,,0,,,,,BR,futaies résineuses,,,4000,4.251558,46.881447
2020-1006407,2020-12-21,000001,Vente,50000,,,CHAMP ROND,B080,71190,71297,Mesvres,71,,,712970000F0335,,,,,,,,,,,,,0,,,,,P,prés,,,19195,4.251558,46.881447
2020-1006407,2020-12-21,000001,Vente,50000,,,CHAMP ROND,B080,71190,71297,Mesvres,71,,,712970000F0336,,,,,,,,,,,,,0,,,,,L,landes,FRICH,Friche,2805,4.251956,46.881601
2020-1006407,2020-12-21,000001,Vente,50000,,,CHAMP ROND,B080,71190,71297,Mesvres,71,,,712970000F0337,,,,,,,,,,,,,0,,,,,BR,futaies résineuses,,,1500,4.253058,46.881921
2020-1006407,2020-12-21,000001,Vente,50000,,,CHAMP ROND,B080,71190,71297,Mesvres,71,,,712970000F0337,,,,,,,,,,,,,0,,,,,T,terres,,,12065,4.253058,46.881921
2020-1006407,2020-12-21,000001,Vente,50000,,,CHAMP ROND,B080,71190,71297,Mesvres,71,,,712970000F0338,,,,,,,,,,,,,0,,,,,BT,taillis simples,,,6600,4.253355,46.88225
2020-1006407,2020-12-21,000001,Vente,50000,,,CHAMP ROND,B080,71190,71297,Mesvres,71,,,712970000F0339,,,,,,,,,,,,,0,,,,,P,prés,,,17335,4.250674,46.882304
2020-1006407,2020-12-21,000001,Vente,50000,,,CHAMP DU BOIS,B068,71190,71297,Mesvres,71,,,712970000F0345,,,,,,,,,,,,,0,,,,,P,prés,,,35032,4.250563,46.887718
2020-1006407,2020-12-21,000001,Vente,50000,,,CHAMP DU BOIS,B068,71190,71297,Mesvres,71,,,712970000F0348,,,,,,,,,,,,,0,,,,,P,prés,,,30730,4.249039,46.886238
2020-1006407,2020-12-21,000001,Vente,50000,,,CHAMP DU BOIS,B068,71190,71297,Mesvres,71,,,712970000F0349,,,,,,,,,,,,,0,,,,,P,prés,,,11060,4.248458,46.884808
2020-1006407,2020-12-21,000001,Vente,50000,,,CHAMP DU BOIS,B068,71190,71297,Mesvres,71,,,712970000F0350,,,,,,,,,,,,,0,,,,,P,prés,,,12550,4.247735,46.884747
2020-1006407,2020-12-21,000001,Vente,50000,,,PATURES DES JONCS,B201,71190,71297,Mesvres,71,,,712970000F0353,,,,,,,,,,,,,0,,,,,P,prés,,,17050,4.248568,46.883125
2020-1006407,2020-12-21,000001,Vente,50000,,,CHAMP ROND,B080,71190,71297,Mesvres,71,,,712970000F0354,,,,,,,,,,,,,0,,,,,P,prés,,,7070,4.247899,46.881824
2020-1006407,2020-12-21,000001,Vente,50000,,,CHAMP ROND,B080,71190,71297,Mesvres,71,,,712970000F0430,,,,,,,,,,,,,0,,,,,J,jardins,,,629,4.247527,46.882981
2020-1006407,2020-12-21,000001,Vente,50000,,,CHAMP ROND,B080,71190,71297,Mesvres,71,,,712970000F0430,,,,,,,,,,,,,0,,,,,P,prés,,,22964,4.247527,46.882981
2020-1006407,2020-12-21,000001,Vente,50000,,,CHAMP ROND,B080,71190,71297,Mesvres,71,,,712970000F0430,,,,,,,,,,,,,0,,,,,S,sols,,,1527,4.247527,46.882981
2020-1006409,2020-12-21,000001,Vente,68408.4,,,CHAMP ROND,B080,71190,71297,Mesvres,71,,,712970000F0335,,,,,,,,,,,,,0,,,,,P,prés,,,19195,4.251558,46.881447
2020-1006409,2020-12-21,000001,Vente,68408.4,,,CHAMP ROND,B080,71190,71297,Mesvres,71,,,712970000F0335,,,,,,,,,,,,,0,,,,,BR,futaies résineuses,,,4000,4.251558,46.881447
2020-1006409,2020-12-21,000001,Vente,68408.4,,,CHAMP ROND,B080,71190,71297,Mesvres,71,,,712970000F0336,,,,,,,,,,,,,0,,,,,L,landes,FRICH,Friche,2805,4.251956,46.881601
2020-1006409,2020-12-21,000001,Vente,68408.4,,,CHAMP ROND,B080,71190,71297,Mesvres,71,,,712970000F0337,,,,,,,,,,,,,0,,,,,T,terres,,,12065,4.253058,46.881921
2020-1006409,2020-12-21,000001,Vente,68408.4,,,CHAMP ROND,B080,71190,71297,Mesvres,71,,,712970000F0337,,,,,,,,,,,,,0,,,,,BR,futaies résineuses,,,1500,4.253058,46.881921
2020-1006409,2020-12-21,000001,Vente,68408.4,,,CHAMP ROND,B080,71190,71297,Mesvres,71,,,712970000F0338,,,,,,,,,,,,,0,,,,,BT,taillis simples,,,6600,4.253355,46.88225
2020-1006409,2020-12-21,000001,Vente,68408.4,,,CHAMP ROND,B080,71190,71297,Mesvres,71,,,712970000F0339,,,,,,,,,,,,,0,,,,,P,prés,,,17335,4.250674,46.882304
2020-1006409,2020-12-21,000001,Vente,68408.4,,,CHAMP DU BOIS,B068,71190,71297,Mesvres,71,,,712970000F0345,,,,,,,,,,,,,0,,,,,P,prés,,,35032,4.250563,46.887718
2020-1006409,2020-12-21,000001,Vente,68408.4,,,CHAMP DU BOIS,B068,71190,71297,Mesvres,71,,,712970000F0348,,,,,,,,,,,,,0,,,,,P,prés,,,30730,4.249039,46.886238
2020-1006409,2020-12-21,000001,Vente,68408.4,,,CHAMP DU BOIS,B068,71190,71297,Mesvres,71,,,712970000F0349,,,,,,,,,,,,,0,,,,,P,prés,,,11060,4.248458,46.884808
2020-1006409,2020-12-21,000001,Vente,68408.4,,,CHAMP DU BOIS,B068,71190,71297,Mesvres,71,,,712970000F0350,,,,,,,,,,,,,0,,,,,P,prés,,,12550,4.247735,46.884747
2020-1006409,2020-12-21,000001,Vente,68408.4,,,PATURES DES JONCS,B201,71190,71297,Mesvres,71,,,712970000F0353,,,,,,,,,,,,,0,,,,,P,prés,,,17050,4.248568,46.883125
2020-1006409,2020-12-21,000001,Vente,68408.4,,,CHAMP ROND,B080,71190,71297,Mesvres,71,,,712970000F0354,,,,,,,,,,,,,0,,,,,P,prés,,,7070,4.247899,46.881824
2020-1006409,2020-12-21,000001,Vente,68408.4,,,CHAMP ROND,B080,71190,71297,Mesvres,71,,,712970000F0430,,,,,,,,,,,,,0,,,,,P,prés,,,22964,4.247527,46.882981
2020-1006409,2020-12-21,000001,Vente,68408.4,,,CHAMP ROND,B080,71190,71297,Mesvres,71,,,712970000F0430,,,,,,,,,,,,,0,,,,,S,sols,,,1527,4.247527,46.882981
2020-1006409,2020-12-21,000001,Vente,68408.4,,,CHAMP ROND,B080,71190,71297,Mesvres,71,,,712970000F0430,,,,,,,,,,,,,0,,,,,J,jardins,,,629,4.247527,46.882981
2020-1006421,2020-12-11,000002,Vente,1000,,,LA POROLLE,B219,71190,71297,Mesvres,71,,,712970000A0089,,,,,,,,,,,,,0,,,,,BR,futaies résineuses,,,365,4.266264,46.907683
2020-1006421,2020-12-11,000002,Vente,1000,,,LE FORET,B120,71190,71297,Mesvres,71,,,712970000A0534,,,,,,,,,,,,,0,,,,,T,terres,,,1535,4.262371,46.898009
2020-1006422,2020-12-11,000001,Vente,70000,540,,RTE DE LA POROLLE,0811,71190,71297,Mesvres,71,,,712970000A0028,,,,,,,,,,,,,0,1,Maison,104,5,S,sols,,,645,4.261726,46.89774
2020-1006422,2020-12-11,000001,Vente,70000,,,LE FORET,B120,71190,71297,Mesvres,71,,,712970000A0535,,,,,,,,,,,,,0,,,,,T,terres,,,835,4.261961,46.897787
2020-1006474,2020-12-16,000001,Vente,90000,5386,,LE PETIT CREUSOT,B205,71190,71297,Mesvres,71,,,712970000E0119,,,,,,,,,,,,,0,3,Dépendance,,0,S,sols,,,73,4.240989,46.850466
2020-1006474,2020-12-16,000001,Vente,90000,5386,,LE PETIT CREUSOT,B205,71190,71297,Mesvres,71,,,712970000E0119,,,,,,,,,,,,,0,3,Dépendance,,0,J,jardins,,,667,4.240989,46.850466
2020-1006474,2020-12-16,000001,Vente,90000,5153,,LE PETIT CREUSOT,B205,71190,71297,Mesvres,71,,,712970000E0120,,,,,,,,,,,,,0,1,Maison,75,4,S,sols,,,746,4.240856,46.850691
