id_mutation,date_mutation,numero_disposition,nature_mutation,valeur_fonciere,adresse_numero,adresse_suffixe,adresse_nom_voie,adresse_code_voie,code_postal,code_commune,nom_commune,code_departement,ancien_code_commune,ancien_nom_commune,id_parcelle,ancien_id_parcelle,numero_volume,lot1_numero,lot1_surface_carrez,lot2_numero,lot2_surface_carrez,lot3_numero,lot3_surface_carrez,lot4_numero,lot4_surface_carrez,lot5_numero,lot5_surface_carrez,nombre_lots,code_type_local,type_local,surface_reelle_bati,nombre_pieces_principales,code_nature_culture,nature_culture,code_nature_culture_speciale,nature_culture_speciale,surface_terrain,longitude,latitude
2020-995714,2020-01-31,000001,Vente,164680,107,,RUE MOREAU,0100,71260,71383,Saint-Albain,71,,,713830000B0361,,,,,,,,,,,,,0,1,Maison,60,3,S,sols,,,189,4.876301,46.42693
2020-995887,2020-02-28,000001,Vente,51500,,,AU MEIX PICHET,B035,71260,71383,Saint-Albain,71,,,71383000ZC0312,,,,,,,,,,,,,0,,,,,P,prés,,,952,4.871669,46.424828
2020-995887,2020-02-28,000001,Vente,51500,,,AU MEIX PICHET,B035,71260,71383,Saint-Albain,71,,,71383000ZC0314,,,,,,,,,,,,,0,,,,,P,prés,,,34,4.87163,46.424941
2020-996217,2020-04-21,000001,Vente,11600,,,LES MOLARDS,B036,71260,71383,Saint-Albain,71,,,71383000ZC0081,,,,,,,,,,,,,0,,,,,VI,vignes,VAOC,Vins d'appellation d'origine contrôlée,1610,4.874745,46.420054
2020-996326,2020-05-20,000001,Vente,47000,,,SOUS BERRY,B049,71260,71383,Saint-Albain,71,,,713830000D0079,,,,,,,,,,,,,0,,,,,S,sols,,,200,4.87668,46.421596
2020-996326,2020-05-20,000001,Vente,47000,934,,RTE DEP 906 QUART BARRAUD,0168,71260,71383,Saint-Albain,71,,,713830000D0080,,,,,,,,,,,,,0,1,Maison,86,3,S,sols,,,615,4.876629,46.421357
2020-996326,2020-05-20,000001,Vente,47000,,,SOUS BERRY,B049,71260,71383,Saint-Albain,71,,,713830000D0081,,,,,,,,,,,,,0,,,,,J,jardins,,,416,4.87657,46.421128
2020-996530,2020-06-15,000001,Vente,1300,,,SUR VESVRE,B059,71260,71383,Saint-Albain,71,,,71383000ZD0075,,,,,,,,,,,,,0,,,,,BP,peupleraies,,,7250,4.886276,46.42291
2020-996545,2020-06-12,000001,Vente,286400,54,,PL AOUT 1944,0010,71260,71383,Saint-Albain,71,,,713830000B0418,,,,,,,,,,,,,0,1,Maison,202,6,S,sols,,,380,4.876626,46.428111
2020-996706,2020-06-19,000001,Vente,86000,,,SAINT ALBAIN,B047,71260,71383,Saint-Albain,71,,,713830000B0425,,,,,,,,,,,,,0,,,,,P,prés,,,640,4.878579,46.428141
2020-996706,2020-06-19,000001,Vente,86000,,,SAINT ALBAIN,B047,71260,71383,Saint-Albain,71,,,713830000B0426,,,,,,,,,,,,,0,,,,,P,prés,,,490,4.878004,46.42813
2020-996706,2020-06-19,000001,Vente,86000,159,,PL AOUT 1944,0010,71260,71383,Saint-Albain,71,,,713830000B1210,,,,,,,,,,,,,0,1,Maison,126,5,S,sols,,,244,4.877659,46.428155
2020-996706,2020-06-19,000001,Vente,86000,,,SAINT ALBAIN,B047,71260,71383,Saint-Albain,71,,,713830000B1211,,,,,,,,,,,,,0,,,,,S,sols,,,30,4.877395,46.428142
2020-996706,2020-06-19,000001,Vente,86000,,,LE BREUIL,B009,71260,71383,Saint-Albain,71,,,71383000ZD0055,,,,,,,,,,,,,0,,,,,P,prés,,,16740,4.879767,46.428169
2020-996706,2020-06-19,000001,Vente,86000,,,LE BREUIL,B009,71260,71383,Saint-Albain,71,,,71383000ZD0093,,,,,,,,,,,,,0,,,,,P,prés,,,410,4.880307,46.428431
2020-996706,2020-06-19,000001,Vente,86000,,,LE BREUIL,B009,71260,71383,Saint-Albain,71,,,71383000ZD0095,,,,,,,,,,,,,0,,,,,P,prés,,,3659,4.882731,46.427983
2020-997629,2020-10-26,000001,Vente,57000,873,,RTE DEP 906 QUART BARRAUD,0168,71260,71383,Saint-Albain,71,,,713830000D0713,,,,,,,,,,,,,0,1,Maison,131,3,S,sols,,,232,4.877191,46.421632
2020-997741,2020-11-10,000001,Vente,157500,198,,RUE DU CHATEAU,0040,71260,71383,Saint-Albain,71,,,713830000B0332,,,,,,,,,,,,,0,1,Maison,118,4,S,sols,,,690,4.873682,46.42592
2020-997741,2020-11-10,000001,Vente,157500,,,SAINT ALBAIN,B047,71260,71383,Saint-Albain,71,,,713830000B1363,,,,,,,,,,,,,0,,,,,P,prés,,,445,4.873445,46.426005
2020-997999,2020-11-26,000001,Vente,154780,87,,RUE MOREAU,0100,71260,71383,Saint-Albain,71,,,713830000B1285,,,,,,,,,,,,,0,3,Dépendance,,0,S,sols,,,573,4.876429,46.426692
2020-997999,2020-11-26,000001,Vente,154780,87,,RUE MOREAU,0100,71260,71383,Saint-Albain,71,,,713830000B1285,,,,,,,,,,,,,0,3,Dépendance,,0,S,sols,,,573,4.876429,46.426692
2020-997999,2020-11-26,000001,Vente,154780,87,,RUE MOREAU,0100,71260,71383,Saint-Albain,71,,,713830000B1285,,,,,,,,,,,,,0,1,Maison,90,5,S,sols,,,573,4.876429,46.426692
2020-998179,2020-12-22,000002,Echange,,,,LES VERCHERONS,B058,71260,71383,Saint-Albain,71,,,71383000ZB0085,,,,,,,,,,,,,0,,,,,B,bois,,,509,4.868034,46.431013
2020-998179,2020-12-22,000002,Echange,,,,SOUS SAINT PANCRAS,B051,71260,71383,Saint-Albain,71,,,71383000ZB0206,,,,,,,,,,,,,0,,,,,S,sols,,,470,4.861174,46.419531
2020-998179,2020-12-22,000002,Echange,,,,SOUS SAINT PANCRAS,B051,71260,71383,Saint-Albain,71,,,71383000ZB0224,,,,,,,,,,,,,0,,,,,VI,vignes,,,640,4.861795,46.419347
2020-998179,2020-12-22,000002,Echange,,,,SOUS SAINT PANCRAS,B051,71260,71383,Saint-Albain,71,,,71383000ZB0231,,,,,,,,,,,,,0,,,,,T,terres,,,4500,4.861326,46.419468
2020-998179,2020-12-22,000002,Echange,,,,LES MURGENNONS,B037,71260,71383,Saint-Albain,71,,,71383000ZC0236,,,,,,,,,,,,,0,,,,,T,terres,,,2226,4.870661,46.430513
