id_mutation,date_mutation,numero_disposition,nature_mutation,valeur_fonciere,adresse_numero,adresse_suffixe,adresse_nom_voie,adresse_code_voie,code_postal,code_commune,nom_commune,code_departement,ancien_code_commune,ancien_nom_commune,id_parcelle,ancien_id_parcelle,numero_volume,lot1_numero,lot1_surface_carrez,lot2_numero,lot2_surface_carrez,lot3_numero,lot3_surface_carrez,lot4_numero,lot4_surface_carrez,lot5_numero,lot5_surface_carrez,nombre_lots,code_type_local,type_local,surface_reelle_bati,nombre_pieces_principales,code_nature_culture,nature_culture,code_nature_culture_speciale,nature_culture_speciale,surface_terrain,longitude,latitude
2020-1007225,2020-06-05,000001,Vente,130000,2254,,RTE DE CHALON,0015,71330,71534,Le Tartre,71,,,71534000ZD0010,,,,,,,,,,,,,0,1,Maison,87,5,S,sols,,,1009,5.339238,46.745742
2020-1007225,2020-06-05,000001,Vente,130000,2254,,RTE DE CHALON,0015,71330,71534,Le Tartre,71,,,71534000ZD0010,,,,,,,,,,,,,0,1,Maison,87,5,J,jardins,,,579,5.339238,46.745742
2020-1007225,2020-06-05,000001,Vente,130000,,,LES RIPPES,B019,71330,71534,Le Tartre,71,,,71534000ZD0011,,,,,,,,,,,,,0,,,,,J,jardins,,,2000,5.339837,46.74569
2020-1007754,2020-10-02,000001,Vente,700,,,LES RENARDIERES,B018,71330,71534,Le Tartre,71,,,71534000ZA0009,,,,,,,,,,,,,0,,,,,S,sols,,,20,5.356953,46.749034
2020-1007928,2020-10-07,000001,Vente,85000,,,LES RIPPES,B019,71330,71534,Le Tartre,71,,,71534000ZD0012,,,,,,,,,,,,,0,,,,,J,jardins,,,300,5.340209,46.745502
2020-1007928,2020-10-07,000001,Vente,85000,2160,,RTE DE CHALON,0015,71330,71534,Le Tartre,71,,,71534000ZD0013,,,,,,,,,,,,,0,1,Maison,72,3,S,sols,,,915,5.340436,46.745649
2020-1007928,2020-10-07,000001,Vente,85000,2160,,RTE DE CHALON,0015,71330,71534,Le Tartre,71,,,71534000ZD0013,,,,,,,,,,,,,0,1,Maison,72,3,J,jardins,,,703,5.340436,46.745649
2020-1007928,2020-10-07,000001,Vente,85000,,,LES RIPPES,B019,71330,71534,Le Tartre,71,,,71534000ZD0014,,,,,,,,,,,,,0,,,,,J,jardins,,,40,5.340567,46.745523
2020-1007928,2020-10-07,000001,Vente,85000,,,LES RIPPES,B019,71330,71534,Le Tartre,71,,,71534000ZD0015,,,,,,,,,,,,,0,,,,,S,sols,,,80,5.340609,46.745489
2020-1008175,2020-12-01,000001,Vente,2000,,,LES RENARDIERES,B018,71330,71534,Le Tartre,71,,,71534000ZA0004,,,,,,,,,,,,,0,,,,,BT,taillis simples,,,4275,,
2020-1008175,2020-12-01,000001,Vente,2000,,,LES RENARDIERES,B018,71330,71534,Le Tartre,71,,,71534000ZA0004,,,,,,,,,,,,,0,,,,,BP,peupleraies,,,4275,,
2020-1008328,2020-12-02,000001,Vente,33000,,,CHAMP D AVAULT,B002,71330,71534,Le Tartre,71,,,71534000ZE0009,,,,,,,,,,,,,0,,,,,T,terres,,,13653,5.339125,46.743885
2020-1008328,2020-12-02,000001,Vente,33000,2006,,RUE DE GOMMERAND,0040,71330,71534,Le Tartre,71,,,71534000ZE0011,,,,,,,,,,,,,0,3,Dépendance,,0,S,sols,,,1000,5.338233,46.740948
2020-1008328,2020-12-02,000001,Vente,33000,2006,,RUE DE GOMMERAND,0040,71330,71534,Le Tartre,71,,,71534000ZE0011,,,,,,,,,,,,,0,1,Maison,57,0,S,sols,,,1000,5.338233,46.740948
2020-1008328,2020-12-02,000001,Vente,33000,2006,,RUE DE GOMMERAND,0040,71330,71534,Le Tartre,71,,,71534000ZE0011,,,,,,,,,,,,,0,1,Maison,57,0,J,jardins,,,1069,5.338233,46.740948
2020-1008328,2020-12-02,000001,Vente,33000,2006,,RUE DE GOMMERAND,0040,71330,71534,Le Tartre,71,,,71534000ZE0011,,,,,,,,,,,,,0,3,Dépendance,,0,J,jardins,,,1069,5.338233,46.740948
2020-1008328,2020-12-02,000001,Vente,33000,,,CHAMP D AVAULT,B002,71330,71534,Le Tartre,71,,,71534000ZE0012,,,,,,,,,,,,,0,,,,,BT,taillis simples,,,2006,5.338884,46.741553
2020-1008328,2020-12-02,000001,Vente,33000,,,CHAMP D AVAULT,B002,71330,71534,Le Tartre,71,,,71534000ZE0012,,,,,,,,,,,,,0,,,,,P,prés,,,5575,5.338884,46.741553
2020-1008403,2020-12-23,000001,Vente,3000,,,LES RENARDIERES,B018,71330,71534,Le Tartre,71,,,71534000ZA0013,,,,,,,,,,,,,0,,,,,BT,taillis simples,,,11110,5.35719,46.7512
