id_mutation,date_mutation,numero_disposition,nature_mutation,valeur_fonciere,adresse_numero,adresse_suffixe,adresse_nom_voie,adresse_code_voie,code_postal,code_commune,nom_commune,code_departement,ancien_code_commune,ancien_nom_commune,id_parcelle,ancien_id_parcelle,numero_volume,lot1_numero,lot1_surface_carrez,lot2_numero,lot2_surface_carrez,lot3_numero,lot3_surface_carrez,lot4_numero,lot4_surface_carrez,lot5_numero,lot5_surface_carrez,nombre_lots,code_type_local,type_local,surface_reelle_bati,nombre_pieces_principales,code_nature_culture,nature_culture,code_nature_culture_speciale,nature_culture_speciale,surface_terrain,longitude,latitude
2020-1012354,2020-10-01,000001,Vente,104400,16,,RUE DU POINT DE BEAUVAIS,0130,72610,72043,Bourg-le-Roi,72,,,720430000A0117,,,,,,,,,,,,,0,1,Maison,103,4,S,sols,,,87,0.132131,48.346697
2020-1012354,2020-10-01,000001,Vente,104400,16,,RUE DU POINT DE BEAUVAIS,0130,72610,72043,Bourg-le-Roi,72,,,720430000A0435,,,,,,,,,,,,,0,,,,,J,jardins,POTAG,Jardin potager,688,0.132072,48.34671
2020-1012450,2020-09-22,000001,Vente,28449,65,,RUE DE LA LIBERATION,0080,72610,72043,Bourg-le-Roi,72,,,720430000A0656,,,,,,,,,,,,,0,,,,,AB,terrains a bâtir,,,481,0.13553,48.344716
2020-1012450,2020-09-22,000001,Vente,28449,65,,RUE DE LA LIBERATION,0080,72610,72043,Bourg-le-Roi,72,,,720430000A0660,,,,,,,,,,,,,0,,,,,AB,terrains a bâtir,,,500,0.135635,48.345016
2020-1015842,2020-12-21,000001,Vente,32500,10,,RUE DU POINT DE BEAUVAIS,0130,72610,72043,Bourg-le-Roi,72,,,720430000A0266,,,,,,,,,,,,,0,1,Maison,133,5,S,sols,,,557,0.131865,48.347291
2020-1015842,2020-12-21,000001,Vente,32500,10,,RUE DU POINT DE BEAUVAIS,0130,72610,72043,Bourg-le-Roi,72,,,720430000A0267,,,,,,,,,,,,,0,,,,,J,jardins,POTAG,Jardin potager,870,0.131671,48.347261
2020-1015918,2020-12-17,000001,Vente,90000,36,,RUE DU POINT DE BEAUVAIS,0130,72610,72043,Bourg-le-Roi,72,,,720430000A0139,,,,,,,,,,,,,0,1,Maison,112,5,S,sols,,,510,0.132706,48.345412
2020-1020456,2020-04-24,000001,Vente,120000,67,,RUE DE LA LIBERATION,0080,72610,72043,Bourg-le-Roi,72,,,720430000A0617,,,,,,,,,,,,,0,1,Maison,85,5,S,sols,,,267,0.13448,48.344646
2020-1020538,2020-05-14,000001,Vente,98000,5315,,IMP DES TISSERANDS,0188,72610,72043,Bourg-le-Roi,72,,,720430000A0489,,,,,,,,,,,,,0,1,Maison,73,4,S,sols,,,528,0.132439,48.343654
