id_mutation,date_mutation,numero_disposition,nature_mutation,valeur_fonciere,adresse_numero,adresse_suffixe,adresse_nom_voie,adresse_code_voie,code_postal,code_commune,nom_commune,code_departement,ancien_code_commune,ancien_nom_commune,id_parcelle,ancien_id_parcelle,numero_volume,lot1_numero,lot1_surface_carrez,lot2_numero,lot2_surface_carrez,lot3_numero,lot3_surface_carrez,lot4_numero,lot4_surface_carrez,lot5_numero,lot5_surface_carrez,nombre_lots,code_type_local,type_local,surface_reelle_bati,nombre_pieces_principales,code_nature_culture,nature_culture,code_nature_culture_speciale,nature_culture_speciale,surface_terrain,longitude,latitude
2020-1012717,2020-10-09,000001,Vente,40000,,,JARDIN DE LA PETITE FERE,B502,72400,72062,La Chapelle-du-Bois,72,,,720620000B0137,,,,,,,,,,,,,0,,,,,J,jardins,POTAG,Jardin potager,595,0.566322,48.238927
2020-1012717,2020-10-09,000001,Vente,40000,,,CHAMP DE LENTE DU PATIS,B159,72400,72062,La Chapelle-du-Bois,72,,,720620000B0818,,,,,,,,,,,,,0,,,,,S,sols,,,36,0.566228,48.239112
2020-1012717,2020-10-09,000001,Vente,40000,5176,,LA PETITE FERE,B639,72400,72062,La Chapelle-du-Bois,72,,,720620000B0819,,,,,,,,,,,,,0,1,Maison,46,2,S,sols,,,562,0.566016,48.239171
2020-1013345,2020-10-14,000001,Vente,21000,,,CHAMP DES LOGES,B188,72400,72062,La Chapelle-du-Bois,72,,,720620000D0234,,,,,,,,,,,,,0,,,,,T,terres,,,35000,0.597451,48.211257
2020-1013647,2020-10-27,000001,Vente,47091.6,,,CHAMP DE DERRIERE,B098,72400,72062,La Chapelle-du-Bois,72,,,720620000B0243,,,,,,,,,,,,,0,,,,,T,terres,,,12160,0.583163,48.240498
2020-1013647,2020-10-27,000001,Vente,47091.6,,,CHAMP DU BOIS,B208,72400,72062,La Chapelle-du-Bois,72,,,720620000B0245,,,,,,,,,,,,,0,,,,,T,terres,,,14125,0.584691,48.240363
2020-1013647,2020-10-27,000001,Vente,47091.6,,,PETIT CHP DE HAUTE BRULEE,B595,72400,72062,La Chapelle-du-Bois,72,,,720620000B0255,,,,,,,,,,,,,0,,,,,T,terres,,,10667,0.585021,48.239112
2020-1013647,2020-10-27,000001,Vente,47091.6,,,BOIS DES TERRIERS,B048,72400,72062,La Chapelle-du-Bois,72,,,720620000B0258,,,,,,,,,,,,,0,,,,,T,terres,,,11460,0.58673,48.240474
2020-1013647,2020-10-27,000001,Vente,47091.6,,,LE BREDANT,B059,72400,72062,La Chapelle-du-Bois,72,,,720620000B0359,,,,,,,,,,,,,0,,,,,T,terres,,,4225,0.582057,48.239389
2020-1013647,2020-10-27,000001,Vente,47091.6,,,COUSIN DU MINERAI,B357,72400,72062,La Chapelle-du-Bois,72,,,720620000B0608,,,,,,,,,,,,,0,,,,,T,terres,,,6570,0.581583,48.240502
2020-1013647,2020-10-27,000001,Vente,47091.6,,,LE CLOS,B310,72400,72062,La Chapelle-du-Bois,72,,,720620000B0733,,,,,,,,,,,,,0,,,,,J,jardins,POTAG,Jardin potager,251,0.582704,48.239135
2020-1013647,2020-10-27,000001,Vente,47091.6,,,LE MINERAI,B548,72400,72062,La Chapelle-du-Bois,72,,,720620000B0741,,,,,,,,,,,,,0,,,,,T,terres,,,7546,0.583386,48.239335
2020-1013647,2020-10-27,000001,Vente,47091.6,,,LA COTIERE,B345,72400,72062,La Chapelle-du-Bois,72,,,720620000B1138,,,,,,,,,,,,,0,,,,,T,terres,,,11482,0.585862,48.239585
2020-1013962,2020-10-20,000001,Vente,152000,9,,RUE DES TILLEULS,0255,72400,72062,La Chapelle-du-Bois,72,,,720620000B1026,,,,,,,,,,,,,0,1,Maison,88,4,S,sols,,,792,0.590031,48.225532
2020-1013995,2020-11-09,000001,Vente,13500,,,LE CHAMP DE DEVANT,B103,72400,72062,La Chapelle-du-Bois,72,,,720620000B0428,,,,,,,,,,,,,0,,,,,P,prés,,,19895,0.598157,48.224572
2020-1013995,2020-11-09,000001,Vente,13500,,,LE CHAMP DE DEVANT,B103,72400,72062,La Chapelle-du-Bois,72,,,720620000B0429,,,,,,,,,,,,,0,,,,,J,jardins,POTAG,Jardin potager,400,0.598282,48.223878
2020-1014002,2020-10-22,000001,Vente,12500,,,CHAMP DES CINQ CHARMES,B172,72400,72062,La Chapelle-du-Bois,72,,,720620000B0332,,,,,,,,,,,,,0,,,,,P,prés,,,9960,0.577853,48.234478
2020-1014002,2020-10-22,000001,Vente,12500,5210,,LA CROIX DES CINQ CHARMES,B363,72400,72062,La Chapelle-du-Bois,72,,,720620000B0716,,,,,,,,,,,,,0,3,Dépendance,,0,S,sols,,,63,0.577326,48.234306
2020-1014002,2020-10-22,000001,Vente,12500,,,LA CROIX DES CINQ CHARMES,B363,72400,72062,La Chapelle-du-Bois,72,,,720620000B0719,,,,,,,,,,,,,0,,,,,J,jardins,POTAG,Jardin potager,108,0.577571,48.234117
2020-1014500,2020-11-23,000001,Vente,145000,18,,RUE DE LA GRANDE RIGAUDIERE,0118,72400,72062,La Chapelle-du-Bois,72,,,720620000D0927,,,,,,,,,,,,,0,1,Maison,88,4,S,sols,,,680,0.588796,48.218717
2020-1015284,2020-12-07,000001,Vente,163000,7,,RUE DES TILLEULS,0255,72400,72062,La Chapelle-du-Bois,72,,,720620000B1025,,,,,,,,,,,,,0,1,Maison,122,5,S,sols,,,779,0.590213,48.225273
2020-1015462,2020-12-04,000001,Vente,75000,5528,,LA GRANDE CIBOLE,B758,72400,72062,La Chapelle-du-Bois,72,,,720620000D0527,,,,,,,,,,,,,0,4,Local industriel. commercial ou assimilé,333,0,S,sols,,,1203,0.620133,48.197577
2020-1015790,2020-11-27,000001,Vente,60000,5133,,LA BASSE CUILLERRERIE,B020,72400,72062,La Chapelle-du-Bois,72,,,720620000D0093,,,,,,,,,,,,,0,1,Maison,52,2,S,sols,,,925,0.584949,48.226525
2020-1015790,2020-11-27,000001,Vente,60000,5133,,LA BASSE CUILLERRERIE,B020,72400,72062,La Chapelle-du-Bois,72,,,720620000D0093,,,,,,,,,,,,,0,1,Maison,52,2,J,jardins,POTAG,Jardin potager,335,0.584949,48.226525
2020-1015790,2020-11-27,000001,Vente,60000,5133,,LA BASSE CUILLERRERIE,B020,72400,72062,La Chapelle-du-Bois,72,,,720620000D0093,,,,,,,,,,,,,0,1,Maison,52,2,P,prés,,,1800,0.584949,48.226525
2020-1015860,2020-12-11,000001,Vente,230000,,,LE GRAND CLOS,B431,72400,72062,La Chapelle-du-Bois,72,,,720620000B0184,,,,,,,,,,,,,0,,,,,P,prés,,,1680,0.582521,48.243524
2020-1015860,2020-12-11,000001,Vente,230000,,,LE PRE NEUF,B687,72400,72062,La Chapelle-du-Bois,72,,,720620000B0188,,,,,,,,,,,,,0,,,,,T,terres,,,3270,0.582273,48.243933
2020-1015860,2020-12-11,000001,Vente,230000,,,LE MARAIS,B536,72400,72062,La Chapelle-du-Bois,72,,,720620000B0189,,,,,,,,,,,,,0,,,,,P,prés,,,3400,0.581525,48.244405
2020-1015860,2020-12-11,000001,Vente,230000,,,LE GRAND CLOS,B431,72400,72062,La Chapelle-du-Bois,72,,,720620000B1088,,,,,,,,,,,,,0,,,,,T,terres,,,1182,0.583153,48.243708
2020-1015860,2020-12-11,000001,Vente,230000,5221,,LE BORDAGE,B051,72400,72062,La Chapelle-du-Bois,72,,,720620000B1090,,,,,,,,,,,,,0,1,Maison,98,4,S,sols,,,705,0.583272,48.243928
2020-1015860,2020-12-11,000001,Vente,230000,,,LE BORDAGE,B051,72400,72062,La Chapelle-du-Bois,72,,,720620000B1091,,,,,,,,,,,,,0,,,,,S,sols,,,245,0.582821,48.243857
2020-1015860,2020-12-11,000001,Vente,230000,,,LE MARAIS,B536,72400,72062,La Chapelle-du-Bois,72,,,720620000B1092,,,,,,,,,,,,,0,,,,,P,prés,,,563,0.583223,48.244027
2020-1015860,2020-12-11,000001,Vente,230000,,,LE MARAIS,B536,72400,72062,La Chapelle-du-Bois,72,,,720620000B1093,,,,,,,,,,,,,0,,,,,P,prés,,,7147,0.58278,48.244462
2020-1015860,2020-12-11,000001,Vente,230000,,,LE GRAND CLOS,B431,72400,72062,La Chapelle-du-Bois,72,,,720620000B1147,,,,,,,,,,,,,0,,,,,T,terres,,,2149,0.58281,48.243457
2020-1016584,2020-12-21,000002,Vente,211400,,,LES FAUSSERAIES,B380,72400,72062,La Chapelle-du-Bois,72,,,720620000A0373,,,,,,,,,,,,,0,,,,,P,prés,,,12600,0.573174,48.230804
2020-1016584,2020-12-21,000002,Vente,211400,,,CLOSEAU DE DERRIERE GRANGE,B333,72400,72062,La Chapelle-du-Bois,72,,,720620000A0375,,,,,,,,,,,,,0,,,,,P,prés,,,10755,0.573058,48.230027
2020-1016584,2020-12-21,000002,Vente,211400,,,CLOSEAU DE DERRIERE GRANGE,B333,72400,72062,La Chapelle-du-Bois,72,,,720620000A0375,,,,,,,,,,,,,0,,,,,S,sols,,,120,0.573058,48.230027
2020-1016584,2020-12-21,000002,Vente,211400,,,LA VALLEE,B731,72400,72062,La Chapelle-du-Bois,72,,,720620000A0686,,,,,,,,,,,,,0,,,,,P,prés,,,713,0.573909,48.230763
2020-1016584,2020-12-21,000002,Vente,211400,,,CHAMP DU BOIS,B208,72400,72062,La Chapelle-du-Bois,72,,,720620000A0945,,,,,,,,,,,,,0,,,,,T,terres,,,1,0.570425,48.230685
2020-1016584,2020-12-21,000002,Vente,211400,,,CHE DE LA COUDRE,0040,72400,72062,La Chapelle-du-Bois,72,,,720620000A0947,,,,,,,,,,,,,0,,,,,T,terres,,,55,0.570446,48.230659
2020-1016584,2020-12-21,000002,Vente,211400,,,CHE DE LA COUDRE,0040,72400,72062,La Chapelle-du-Bois,72,,,720620000A0950,,,,,,,,,,,,,0,,,,,T,terres,,,54,0.570673,48.23019
2020-1016584,2020-12-21,000002,Vente,211400,,,CHE DE LA COUDRE,0040,72400,72062,La Chapelle-du-Bois,72,,,720620000A0953,,,,,,,,,,,,,0,,,,,T,terres,,,58,0.570858,48.229809
2020-1016584,2020-12-21,000002,Vente,211400,,,CHAMP DE LA BROSSE,B117,72400,72062,La Chapelle-du-Bois,72,,,720620000A0954,,,,,,,,,,,,,0,,,,,T,terres,,,2255,0.570198,48.231762
2020-1016658,2020-12-21,000001,Vente,135000,,,CHE DE LA COUDRE,0040,72400,72062,La Chapelle-du-Bois,72,,,720620000A0461,,,,,,,,,,,,,0,,,,,S,sols,,,119,0.571119,48.229278
2020-1016658,2020-12-21,000001,Vente,135000,5207,,LA COUDRE,B353,72400,72062,La Chapelle-du-Bois,72,,,720620000A0849,,,,,,,,,,,,,0,1,Maison,119,6,S,sols,,,1642,0.571394,48.229314
2020-1016658,2020-12-21,000001,Vente,135000,5207,,LA COUDRE,B353,72400,72062,La Chapelle-du-Bois,72,,,720620000A0849,,,,,,,,,,,,,0,1,Maison,119,6,P,prés,,,1139,0.571394,48.229314
2020-1016658,2020-12-21,000001,Vente,135000,,,CHE DE LA COUDRE,0040,72400,72062,La Chapelle-du-Bois,72,,,720620000A0952,,,,,,,,,,,,,0,,,,,T,terres,,,63,0.570958,48.229596
2020-1020018,2020-01-17,000001,Vente,20106,2,,RUE DE LA GRANDE RIGAUDIERE,0118,72400,72062,La Chapelle-du-Bois,72,,,720620000D0626,,,,,,,,,,,,,0,,,,,P,prés,,,2234,0.589691,48.219933
2020-1020466,2020-04-29,000001,Vente,12000,,,BOIS DE GRANDE RAQUOISIERE,B036,72400,72062,La Chapelle-du-Bois,72,,,720620000B0599,,,,,,,,,,,,,0,,,,,BT,taillis simples,,,20596,0.562732,48.24185
2020-1020600,2020-05-25,000001,Vente,139000,2,,RUE DE LA GRANDE RIGAUDIERE,0118,72400,72062,La Chapelle-du-Bois,72,,,720620000D0634,,,,,,,,,,,,,0,1,Maison,90,5,S,sols,,,700,0.590747,48.220387
2020-1020822,2020-06-29,000001,Vente,108000,1,,RUE DES ROSES,0208,72400,72062,La Chapelle-du-Bois,72,,,720620000B0824,,,,,,,,,,,,,0,1,Maison,75,4,S,sols,,,454,0.591809,48.224023
2020-1020911,2020-07-08,000001,Vente,29187,16,,RUE DE LA GRANDE RIGAUDIERE,0118,72400,72062,La Chapelle-du-Bois,72,,,720620000D0928,,,,,,,,,,,,,0,,,,,AB,terrains a bâtir,,,621,0.588845,48.218898
2020-1020988,2020-07-30,000001,Vente,250000,5177,,LA CROIX NOIRE,B364,72400,72062,La Chapelle-du-Bois,72,,,720620000B0110,,,,,,,,,,,,,0,1,Maison,138,5,S,sols,,,645,0.572331,48.237372
2020-1020988,2020-07-30,000001,Vente,250000,,,LE CLOTEAU,B340,72400,72062,La Chapelle-du-Bois,72,,,720620000B0111,,,,,,,,,,,,,0,,,,,AG,terrains d'agrément,,,1140,0.57204,48.237128
2020-1020988,2020-07-30,000001,Vente,250000,,,LE CLOTEAU,B340,72400,72062,La Chapelle-du-Bois,72,,,720620000B0111,,,,,,,,,,,,,0,,,,,S,sols,,,25,0.57204,48.237128
2020-1020988,2020-07-30,000001,Vente,250000,,,CLOS DU POT,B328,72400,72062,La Chapelle-du-Bois,72,,,720620000B0114,,,,,,,,,,,,,0,,,,,T,terres,,,2245,0.571626,48.236744
2020-1020988,2020-07-30,000001,Vente,250000,,,LA CROIX NOIRE,B364,72400,72062,La Chapelle-du-Bois,72,,,720620000B0115,,,,,,,,,,,,,0,,,,,T,terres,,,265,0.571167,48.236661
2020-1020988,2020-07-30,000001,Vente,250000,,,PRE DES MARNIERES,B683,72400,72062,La Chapelle-du-Bois,72,,,720620000B0728,,,,,,,,,,,,,0,,,,,S,sols,,,117,0.572456,48.237347
2020-1020988,2020-07-30,000001,Vente,250000,,,CHAMP DE CHATTE DES COCUS,B096,72400,72062,La Chapelle-du-Bois,72,,,720620000B0730,,,,,,,,,,,,,0,,,,,S,sols,,,285,0.572435,48.237438
2020-1020988,2020-07-30,000001,Vente,250000,,,PRE DES MARNIERES,B683,72400,72062,La Chapelle-du-Bois,72,,,720620000B0953,,,,,,,,,,,,,0,,,,,P,prés,,,677,0.572279,48.237043
2020-1020988,2020-07-30,000001,Vente,250000,,,CHAMP DE CHATTE DES COCUS,B096,72400,72062,La Chapelle-du-Bois,72,,,720620000B0955,,,,,,,,,,,,,0,,,,,T,terres,,,399,0.57257,48.237416
2020-1021056,2020-08-22,000001,Vente,157000,5121,,LA GRANDE RIGAUDIERE,B466,72400,72062,La Chapelle-du-Bois,72,,,720620000D0882,,,,,,,,,,,,,0,1,Maison,93,3,S,sols,,,747,0.590342,48.22027
2020-1021056,2020-08-22,000001,Vente,157000,5121,,LA GRANDE RIGAUDIERE,B466,72400,72062,La Chapelle-du-Bois,72,,,720620000D0882,,,,,,,,,,,,,0,1,Maison,71,1,S,sols,,,747,0.590342,48.22027
2020-1021056,2020-08-22,000001,Vente,157000,,,LA GRANDE RIGAUDIERE,B466,72400,72062,La Chapelle-du-Bois,72,,,720620000D0977,,,,,,,,,,,,,0,,,,,AG,terrains d'agrément,,,258,0.590513,48.220136
2020-1021056,2020-08-22,000001,Vente,157000,,,LA GRANDE RIGAUDIERE,B466,72400,72062,La Chapelle-du-Bois,72,,,720620000D0978,,,,,,,,,,,,,0,,,,,S,sols,,,11,0.590175,48.22036
2020-1021272,2020-09-15,000001,Vente,100000,12,,RUE DE MAMERS,0145,72400,72062,La Chapelle-du-Bois,72,,,720620000B0480,,,,,,,,,,,,,0,1,Maison,78,3,S,sols,,,560,0.591716,48.222483
2020-1021272,2020-09-15,000001,Vente,100000,,,RUE DES ECOLES,0103,72400,72062,La Chapelle-du-Bois,72,,,720620000B0894,,,,,,,,,,,,,0,,,,,S,sols,,,215,0.592055,48.222742
