id_mutation,date_mutation,numero_disposition,nature_mutation,valeur_fonciere,adresse_numero,adresse_suffixe,adresse_nom_voie,adresse_code_voie,code_postal,code_commune,nom_commune,code_departement,ancien_code_commune,ancien_nom_commune,id_parcelle,ancien_id_parcelle,numero_volume,lot1_numero,lot1_surface_carrez,lot2_numero,lot2_surface_carrez,lot3_numero,lot3_surface_carrez,lot4_numero,lot4_surface_carrez,lot5_numero,lot5_surface_carrez,nombre_lots,code_type_local,type_local,surface_reelle_bati,nombre_pieces_principales,code_nature_culture,nature_culture,code_nature_culture_speciale,nature_culture_speciale,surface_terrain,longitude,latitude
2020-1014864,2020-11-23,000001,Vente,190000,1,,RUE DE LA COURBE,0301,72300,72343,Souvigné-sur-Sarthe,72,,,723430000B0592,,,,,,,,,,,,,0,1,Maison,140,5,S,sols,,,874,-0.39418,47.82354
2020-1015398,2020-12-11,000001,Vente,114000,,,LE CHAMP DE LA MORICIERE,B139,72300,72343,Souvigné-sur-Sarthe,72,,,723430000A0479,,,,,,,,,,,,,0,,,,,T,terres,,,12000,-0.423713,47.82844
2020-1015398,2020-12-11,000001,Vente,114000,,,LE VERGER DU GRAND JARDIN,B788,72300,72343,Souvigné-sur-Sarthe,72,,,723430000A0480,,,,,,,,,,,,,0,,,,,P,prés,,,4840,-0.424303,47.828926
2020-1015398,2020-12-11,000001,Vente,114000,,,LE FOURNEAU,B391,72300,72343,Souvigné-sur-Sarthe,72,,,723430000A0481,,,,,,,,,,,,,0,,,,,P,prés,,,775,-0.424457,47.82858
2020-1015398,2020-12-11,000001,Vente,114000,,,LE JARDIN DU FOURNEAU,B468,72300,72343,Souvigné-sur-Sarthe,72,,,723430000A0482,,,,,,,,,,,,,0,,,,,P,prés,,,1005,-0.424714,47.828768
2020-1015398,2020-12-11,000001,Vente,114000,,,LE BOIS DE LA COULEE,B020,72300,72343,Souvigné-sur-Sarthe,72,,,723430000A0485,,,,,,,,,,,,,0,,,,,BT,taillis simples,,,5550,-0.424391,47.829557
2020-1015398,2020-12-11,000001,Vente,114000,,,LE CHAMP DU FOURNEAU,B280,72300,72343,Souvigné-sur-Sarthe,72,,,723430000A1045,,,,,,,,,,,,,0,,,,,T,terres,,,10753,-0.425109,47.828434
2020-1015398,2020-12-11,000001,Vente,114000,,,LE JARDIN DU PLESSIS,B477,72300,72343,Souvigné-sur-Sarthe,72,,,723430000B0268,,,,,,,,,,,,,0,,,,,S,sols,,,80,-0.424537,47.825712
2020-1015398,2020-12-11,000001,Vente,114000,,,LE JARDIN DU PLESSIS,B477,72300,72343,Souvigné-sur-Sarthe,72,,,723430000B0268,,,,,,,,,,,,,0,,,,,T,terres,,,2440,-0.424537,47.825712
2020-1015398,2020-12-11,000001,Vente,114000,,,LE CHAMP DE L AIRE,B067,72300,72343,Souvigné-sur-Sarthe,72,,,723430000B0269,,,,,,,,,,,,,0,,,,,S,sols,,,1250,-0.424298,47.825333
2020-1015398,2020-12-11,000001,Vente,114000,,,LA MARE DU PLESSIS,B499,72300,72343,Souvigné-sur-Sarthe,72,,,723430000B0270,,,,,,,,,,,,,0,,,,,E,eaux,MARE,Mare,585,-0.423969,47.825214
2020-1015398,2020-12-11,000001,Vente,114000,,,LE PLESSIS,B538,72300,72343,Souvigné-sur-Sarthe,72,,,723430000B0271,,,,,,,,,,,,,0,,,,,S,sols,,,515,-0.424013,47.82529
2020-1015398,2020-12-11,000001,Vente,114000,5120,,LE PLESSIS,B538,72300,72343,Souvigné-sur-Sarthe,72,,,723430000B0272,,,,,,,,,,,,,0,1,Maison,170,5,S,sols,,,820,-0.42417,47.825669
2020-1015398,2020-12-11,000001,Vente,114000,,,LE PLESSIS,B538,72300,72343,Souvigné-sur-Sarthe,72,,,723430000B0273,,,,,,,,,,,,,0,,,,,S,sols,,,1285,-0.423822,47.82582
2020-1015398,2020-12-11,000001,Vente,114000,,,LE CHAMP DE LA CHATAIGNERA,B087,72300,72343,Souvigné-sur-Sarthe,72,,,723430000B0274,,,,,,,,,,,,,0,,,,,P,prés,,,7470,-0.424101,47.826273
2020-1015398,2020-12-11,000001,Vente,114000,,,LE CHAMP DE LA CHATAIGNERA,B087,72300,72343,Souvigné-sur-Sarthe,72,,,723430000B0274,,,,,,,,,,,,,0,,,,,S,sols,,,420,-0.424101,47.826273
2020-1015398,2020-12-11,000001,Vente,114000,,,LE PRE DE LA GALICHERIE,B579,72300,72343,Souvigné-sur-Sarthe,72,,,723430000B0276,,,,,,,,,,,,,0,,,,,P,prés,,,4855,-0.425734,47.827322
2020-1015398,2020-12-11,000001,Vente,114000,,,LE VERGER DE LA GALICHERIE,B749,72300,72343,Souvigné-sur-Sarthe,72,,,723430000B0281,,,,,,,,,,,,,0,,,,,VE,vergers,CIDRE,Cidre,1500,-0.423803,47.827012
2020-1015398,2020-12-11,000001,Vente,114000,,,LE VERGER DE LA CHATAIGNER,B736,72300,72343,Souvigné-sur-Sarthe,72,,,723430000B0282,,,,,,,,,,,,,0,,,,,VE,vergers,CIDRE,Cidre,2250,-0.423117,47.826881
2020-1015398,2020-12-11,000001,Vente,114000,,,LE CHAMP DE LA NOE,B140,72300,72343,Souvigné-sur-Sarthe,72,,,723430000B0283,,,,,,,,,,,,,0,,,,,T,terres,,,3240,-0.422755,47.827282
2020-1015398,2020-12-11,000001,Vente,114000,,,LE VERGER DE LA COMMUNE,B739,72300,72343,Souvigné-sur-Sarthe,72,,,723430000B0284,,,,,,,,,,,,,0,,,,,VE,vergers,CIDRE,Cidre,280,-0.422269,47.826964
2020-1015398,2020-12-11,000001,Vente,114000,,,LE CHAMP DU GRAND SUCHERAY,B294,72300,72343,Souvigné-sur-Sarthe,72,,,723430000B0291,,,,,,,,,,,,,0,,,,,P,prés,,,27320,-0.42117,47.826788
2020-1015398,2020-12-11,000001,Vente,114000,,,LE PRE DE LA COULEE,B567,72300,72343,Souvigné-sur-Sarthe,72,,,723430000B0292,,,,,,,,,,,,,0,,,,,P,prés,,,28770,-0.421716,47.825804
2020-1015398,2020-12-11,000001,Vente,114000,,,LE CHAMP DU SUCHERAY,B324,72300,72343,Souvigné-sur-Sarthe,72,,,723430000B0293,,,,,,,,,,,,,0,,,,,P,prés,,,23300,-0.42101,47.82498
2020-1015398,2020-12-11,000001,Vente,114000,,,LE VERGER DU PLESSIS,B800,72300,72343,Souvigné-sur-Sarthe,72,,,723430000B0294,,,,,,,,,,,,,0,,,,,VE,vergers,CIDRE,Cidre,2070,-0.422884,47.824595
2020-1015398,2020-12-11,000001,Vente,114000,,,CHE DE LA GALICHERIE,0480,72300,72343,Souvigné-sur-Sarthe,72,,,723430000B0354,,,,,,,,,,,,,0,,,,,T,terres,,,311,-0.424825,47.827561
2020-1015398,2020-12-11,000001,Vente,114000,,,LE JARDIN DE LA GALICHERIE,B439,72300,72343,Souvigné-sur-Sarthe,72,,,723430000B0356,,,,,,,,,,,,,0,,,,,J,jardins,POTAG,Jardin potager,1271,-0.42348,47.82757
2020-1015398,2020-12-11,000001,Vente,114000,,,LE CHAMP DU FOND,B279,72300,72343,Souvigné-sur-Sarthe,72,,,723430000B0358,,,,,,,,,,,,,0,,,,,T,terres,,,2852,-0.424536,47.827854
2020-1015398,2020-12-11,000001,Vente,114000,,,LA GALICHERIE,B392,72300,72343,Souvigné-sur-Sarthe,72,,,723430000B0359,,,,,,,,,,,,,0,,,,,T,terres,,,216,-0.423772,47.82775
2020-1015398,2020-12-11,000001,Vente,114000,,,LA GALICHERIE,B392,72300,72343,Souvigné-sur-Sarthe,72,,,723430000B0362,,,,,,,,,,,,,0,,,,,S,sols,,,881,-0.423446,47.827196
2020-1015398,2020-12-11,000001,Vente,114000,,,LE CHAMP DE DEVANT,B065,72300,72343,Souvigné-sur-Sarthe,72,,,723430000B0364,,,,,,,,,,,,,0,,,,,T,terres,,,20040,-0.425306,47.826623
2020-1019089,2020-04-30,000001,Vente,110000,13,,RTE DE BOUESSAY,0114,72300,72343,Souvigné-sur-Sarthe,72,,,723430000A0991,,,,,,,,,,,,,0,1,Maison,102,5,S,sols,,,1237,-0.38267,47.829324
2020-1019242,2020-05-14,000001,Vente,36500,,,LE CHAMP DES NOES,B231,72300,72343,Souvigné-sur-Sarthe,72,,,723430000C0549,,,,,,,,,,,,,0,,,,,AB,terrains a bâtir,,,999,-0.388556,47.825385
2020-1019242,2020-05-14,000001,Vente,36500,,,LE CHAMP DES NOES,B231,72300,72343,Souvigné-sur-Sarthe,72,,,723430000C0550,,,,,,,,,,,,,0,,,,,AB,terrains a bâtir,,,1472,-0.388821,47.825076
2020-1019561,2020-07-01,000001,Vente,240000,6,,RTE DE SAINT BRICE,0828,72300,72343,Souvigné-sur-Sarthe,72,,,723430000B0686,,,,,,,,,,,,,0,1,Maison,171,5,S,sols,,,1000,-0.392054,47.827231
2020-1019561,2020-07-01,000001,Vente,240000,6,,RTE DE SAINT BRICE,0828,72300,72343,Souvigné-sur-Sarthe,72,,,723430000B0686,,,,,,,,,,,,,0,1,Maison,171,5,AG,terrains d'agrément,,,1069,-0.392054,47.827231
2020-1019561,2020-07-01,000001,Vente,240000,,,LE CHAMP VALLET,B350,72300,72343,Souvigné-sur-Sarthe,72,,,723430000B0688,,,,,,,,,,,,,0,,,,,P,prés,,,2212,-0.392646,47.826928
