id_mutation,date_mutation,numero_disposition,nature_mutation,valeur_fonciere,adresse_numero,adresse_suffixe,adresse_nom_voie,adresse_code_voie,code_postal,code_commune,nom_commune,code_departement,ancien_code_commune,ancien_nom_commune,id_parcelle,ancien_id_parcelle,numero_volume,lot1_numero,lot1_surface_carrez,lot2_numero,lot2_surface_carrez,lot3_numero,lot3_surface_carrez,lot4_numero,lot4_surface_carrez,lot5_numero,lot5_surface_carrez,nombre_lots,code_type_local,type_local,surface_reelle_bati,nombre_pieces_principales,code_nature_culture,nature_culture,code_nature_culture_speciale,nature_culture_speciale,surface_terrain,longitude,latitude
2020-1012617,2020-09-29,000001,Vente,145000,2,,LE CHENE BLANC,B212,72440,72382,Volnay,72,,,723820000B0216,,,,,,,,,,,,,0,1,Maison,140,5,S,sols,,,1230,0.477644,47.947981
2020-1012617,2020-09-29,000001,Vente,145000,,,CHAMP DE DERRIERE,B073,72440,72382,Volnay,72,,,723820000B0690,,,,,,,,,,,,,0,,,,,P,prés,,,3024,0.477061,47.947719
2020-1013226,2020-10-02,000001,Vente,122500,,,LES PLOUSES,B494,72440,72382,Volnay,72,,,723820000C0780,,,,,,,,,,,,,0,,,,,BR,futaies résineuses,PIN,Pins,5771,0.46061,47.930994
2020-1013226,2020-10-02,000001,Vente,122500,5323,,LES PLOUSES,B494,72440,72382,Volnay,72,,,723820000C0781,,,,,,,,,,,,,0,1,Maison,97,5,BR,futaies résineuses,PIN,Pins,5458,0.461183,47.930842
2020-1013226,2020-10-02,000001,Vente,122500,5323,,LES PLOUSES,B494,72440,72382,Volnay,72,,,723820000C0781,,,,,,,,,,,,,0,1,Maison,97,5,S,sols,,,188,0.461183,47.930842
2020-1013605,2020-10-07,000001,Vente,28000,5389,,LE GRAND PRE,B299,72440,72382,Volnay,72,,,723820000A0251,,,,,,,,,,,,,0,3,Dépendance,,0,S,sols,,,49,0.461255,47.973101
2020-1013605,2020-10-07,000001,Vente,28000,5389,,LE GRAND PRE,B299,72440,72382,Volnay,72,,,723820000A0251,,,,,,,,,,,,,0,3,Dépendance,,0,P,prés,,,1780,0.461255,47.973101
2020-1013605,2020-10-07,000001,Vente,28000,5389,,LE GRAND PRE,B299,72440,72382,Volnay,72,,,723820000A0251,,,,,,,,,,,,,0,3,Dépendance,,0,E,eaux,ETANG,Etangs,434,0.461255,47.973101
2020-1014081,2020-11-06,000001,Vente,110000,,,BAS JARDIN,B020,72440,72382,Volnay,72,,,723820000C0742,,,,,,,,,,,,,0,,,,,P,prés,,,720,0.46557,47.933375
2020-1014081,2020-11-06,000001,Vente,110000,,,BAS JARDIN,B020,72440,72382,Volnay,72,,,723820000C0742,,,,,,,,,,,,,0,,,,,S,sols,,,35,0.46557,47.933375
2020-1014081,2020-11-06,000001,Vente,110000,,,LE BOURG,B040,72440,72382,Volnay,72,,,723820000C0743,,,,,,,,,,,,,0,,,,,J,jardins,,,928,0.465963,47.933517
2020-1014081,2020-11-06,000001,Vente,110000,,,LE BOURG,B040,72440,72382,Volnay,72,,,723820000C0743,,,,,,,,,,,,,0,,,,,S,sols,,,55,0.465963,47.933517
2020-1014081,2020-11-06,000001,Vente,110000,27,,RUE PRINCIPALE,0112,72440,72382,Volnay,72,,,723820000C1269,,,,,,,,,,,,,0,1,Maison,135,5,S,sols,,,864,0.4664,47.933659
2020-1014081,2020-11-06,000001,Vente,110000,27,,RUE PRINCIPALE,0112,72440,72382,Volnay,72,,,723820000C1270,,,,,,,,,,,,,0,,,,,S,sols,,,7,0.465553,47.933317
2020-1014235,2020-11-04,000001,Vente,135000,5002,,LA GUITONNIERE,B328,72440,72382,Volnay,72,,,723820000A1081,,,,,,,,,,,,,0,1,Maison,158,4,P,prés,,,2077,0.443077,47.970043
2020-1014235,2020-11-04,000001,Vente,135000,5002,,LA GUITONNIERE,B328,72440,72382,Volnay,72,,,723820000A1081,,,,,,,,,,,,,0,1,Maison,158,4,S,sols,,,2594,0.443077,47.970043
2020-1014381,2020-11-17,000001,Vente,17000,,,LE PRE DU GUE DE FORGE,B536,72440,72382,Volnay,72,,,723820000A1141,,,,,,,,,,,,,0,,,,,P,prés,,,1945,0.466841,47.973555
2020-1014381,2020-11-17,000001,Vente,17000,,,LE PRE DU GUE DE FORGE,B536,72440,72382,Volnay,72,,,723820000A1141,,,,,,,,,,,,,0,,,,,E,eaux,ETANG,Etangs,1056,0.466841,47.973555
2020-1014723,2020-11-23,000001,Vente,165000,4,,LOT DE LA CHAUSSEE,A016,72440,72382,Volnay,72,,,723820000A0967,,,,,,,,,,,,,0,1,Maison,111,6,J,jardins,,,1435,0.46027,47.970827
2020-1014723,2020-11-23,000001,Vente,165000,4,,LOT DE LA CHAUSSEE,A016,72440,72382,Volnay,72,,,723820000A0967,,,,,,,,,,,,,0,1,Maison,111,6,S,sols,,,942,0.46027,47.970827
2020-1015745,2020-12-15,000001,Vente,130000,,,CHAMP DE LA GRANGE,B100,72440,72382,Volnay,72,,,723820000A0083,,,,,,,,,,,,,0,,,,,T,terres,,,5032,0.456247,47.968536
2020-1015745,2020-12-15,000001,Vente,130000,,,CHAMP DE LA GRANGE,B100,72440,72382,Volnay,72,,,723820000A0084,,,,,,,,,,,,,0,,,,,P,prés,,,3554,0.456376,47.968044
2020-1015745,2020-12-15,000001,Vente,130000,,,CHAMP DU MILIEU,B171,72440,72382,Volnay,72,,,723820000A0086,,,,,,,,,,,,,0,,,,,T,terres,,,8660,0.455403,47.967009
2020-1015745,2020-12-15,000001,Vente,130000,,,CHAMP DU MILIEU,B171,72440,72382,Volnay,72,,,723820000A0087,,,,,,,,,,,,,0,,,,,P,prés,,,1740,0.454863,47.967266
2020-1015745,2020-12-15,000001,Vente,130000,5011,,LES MARCHANDIERES,B384,72440,72382,Volnay,72,,,723820000A0088,,,,,,,,,,,,,0,1,Maison,93,2,S,sols,,,2236,0.45523,47.968459
2020-1015745,2020-12-15,000001,Vente,130000,,,LES MARCHANDIERES,B384,72440,72382,Volnay,72,,,723820000A0089,,,,,,,,,,,,,0,,,,,P,prés,,,1118,0.455141,47.96888
2020-1015745,2020-12-15,000001,Vente,130000,,,LES MARTICEAUX,B386,72440,72382,Volnay,72,,,723820000A0152,,,,,,,,,,,,,0,,,,,T,terres,,,10981,0.456707,47.966008
2020-1015745,2020-12-15,000001,Vente,130000,,,PIERRE DE LA GRANDE CHAUSS,B486,72440,72382,Volnay,72,,,723820000A1069,,,,,,,,,,,,,0,,,,,T,terres,,,12570,0.455845,47.969164
2020-1015745,2020-12-15,000001,Vente,130000,,,PIERRE DE LA GRANDE CHAUSS,B486,72440,72382,Volnay,72,,,723820000A1071,,,,,,,,,,,,,0,,,,,T,terres,,,472,0.456771,47.969041
2020-1015745,2020-12-15,000001,Vente,130000,,,ANCIEN CHEMIN RURAL,B005,72440,72382,Volnay,72,,,723820000A1073,,,,,,,,,,,,,0,,,,,T,terres,,,408,0.45633,47.968704
2020-1015757,2020-12-09,000001,Vente,68000,,,CHAMP DU GRAND ROLON,B166,72440,72382,Volnay,72,,,723820000A0830,,,,,,,,,,,,,0,,,,,S,sols,,,203,0.4992,47.965457
2020-1015757,2020-12-09,000001,Vente,68000,5082,,BELLEVUE,B027,72440,72382,Volnay,72,,,723820000A0833,,,,,,,,,,,,,0,1,Maison,54,4,S,sols,,,629,0.499136,47.965563
2020-1015757,2020-12-09,000001,Vente,68000,,,BELLEVUE,B027,72440,72382,Volnay,72,,,723820000A0928,,,,,,,,,,,,,0,,,,,J,jardins,,,113,0.49935,47.965566
2020-1015757,2020-12-09,000001,Vente,68000,,,BELLEVUE,B027,72440,72382,Volnay,72,,,723820000A0929,,,,,,,,,,,,,0,,,,,J,jardins,,,24,0.499098,47.965724
2020-1015757,2020-12-09,000001,Vente,68000,,,BELLEVUE,B027,72440,72382,Volnay,72,,,723820000A0930,,,,,,,,,,,,,0,,,,,J,jardins,,,33,0.498942,47.965603
2020-1015757,2020-12-09,000001,Vente,68000,,,CHAMP ROLON LE PLUS LOIN,B200,72440,72382,Volnay,72,,,723820000A0932,,,,,,,,,,,,,0,,,,,J,jardins,,,28,0.498951,47.965678
2020-1015757,2020-12-09,000001,Vente,68000,,,BELLEVUE,B027,72440,72382,Volnay,72,,,723820000A0934,,,,,,,,,,,,,0,,,,,J,jardins,,,24,0.498941,47.965551
2020-1015757,2020-12-09,000001,Vente,68000,,,CHAMP DU GRAND ROLON,B166,72440,72382,Volnay,72,,,723820000A0936,,,,,,,,,,,,,0,,,,,J,jardins,,,229,0.499151,47.965444
2020-1016459,2020-12-21,000001,Vente,53400,,,RUE CHELLE,0040,72440,72382,Volnay,72,,,723820000A0631,,,,,,,,,,,,,0,,,,,T,terres,,,9917,0.498684,47.967551
2020-1016459,2020-12-21,000001,Vente,53400,,,CHAMP ROLON LE PLUS LOIN,B200,72440,72382,Volnay,72,,,723820000A0632,,,,,,,,,,,,,0,,,,,T,terres,,,14595,0.49834,47.966709
2020-1016459,2020-12-21,000001,Vente,53400,,,LA PIECE,B476,72440,72382,Volnay,72,,,723820000A0668,,,,,,,,,,,,,0,,,,,T,terres,,,26126,0.501526,47.963626
2020-1016459,2020-12-21,000001,Vente,53400,,,LA PIECE,B476,72440,72382,Volnay,72,,,723820000A0668,,,,,,,,,,,,,0,,,,,T,terres,,,52252,0.501526,47.963626
2020-1016459,2020-12-21,000001,Vente,53400,,,CHAMP DU GRAND ROLON,B166,72440,72382,Volnay,72,,,723820000A0672,,,,,,,,,,,,,0,,,,,T,terres,,,16554,0.497951,47.964139
2020-1016459,2020-12-21,000001,Vente,53400,,,PETITE PIECE,B465,72440,72382,Volnay,72,,,723820000A0673,,,,,,,,,,,,,0,,,,,VE,vergers,CIDRE,Cidre,11008,0.49948,47.963835
2020-1016459,2020-12-21,000001,Vente,53400,,,CHAMP DU RUAU,B182,72440,72382,Volnay,72,,,723820000A0674,,,,,,,,,,,,,0,,,,,T,terres,,,7700,0.49847,47.963233
2020-1016459,2020-12-21,000001,Vente,53400,,,LES CLOTEAUX,B233,72440,72382,Volnay,72,,,723820000A0681,,,,,,,,,,,,,0,,,,,T,terres,,,5804,0.501975,47.961409
2020-1016459,2020-12-21,000001,Vente,53400,,,TAILLIS DES CLOTEAUX,B611,72440,72382,Volnay,72,,,723820000A0682,,,,,,,,,,,,,0,,,,,BS,taillis sous futaie,,,8350,0.502365,47.960796
2020-1016459,2020-12-21,000001,Vente,53400,,,ROULON DE L AUTRE BOUT,B565,72440,72382,Volnay,72,,,723820000A0733,,,,,,,,,,,,,0,,,,,T,terres,,,21300,0.496656,47.965188
2020-1016459,2020-12-21,000001,Vente,53400,,,LE PETIT ROLON,B452,72440,72382,Volnay,72,,,723820000A0842,,,,,,,,,,,,,0,,,,,T,terres,,,1398,0.49945,47.965973
2020-1016459,2020-12-21,000001,Vente,53400,,,LE PETIT ROLON,B452,72440,72382,Volnay,72,,,723820000A0842,,,,,,,,,,,,,0,,,,,S,sols,,,472,0.49945,47.965973
2020-1016459,2020-12-21,000001,Vente,53400,,,CHAMP ROLON LE PLUS LOIN,B200,72440,72382,Volnay,72,,,723820000A0933,,,,,,,,,,,,,0,,,,,S,sols,,,88,0.49772,47.965876
2020-1016459,2020-12-21,000001,Vente,53400,,,CHAMP ROLON LE PLUS LOIN,B200,72440,72382,Volnay,72,,,723820000A0933,,,,,,,,,,,,,0,,,,,T,terres,,,11570,0.49772,47.965876
2020-1016459,2020-12-21,000001,Vente,53400,,,BELLEVUE,B027,72440,72382,Volnay,72,,,723820000A0935,,,,,,,,,,,,,0,,,,,P,prés,,,174,0.498633,47.965553
2020-1016459,2020-12-21,000001,Vente,53400,,,BELLEVUE,B027,72440,72382,Volnay,72,,,723820000A1116,,,,,,,,,,,,,0,,,,,S,sols,,,717,0.499292,47.965778
2020-1016459,2020-12-21,000001,Vente,53400,,,CHAMP DU GRAND ROLON,B166,72440,72382,Volnay,72,,,723820000A1119,,,,,,,,,,,,,0,,,,,T,terres,,,8570,0.499018,47.965063
2020-1016561,2020-12-28,000001,Vente,10000,5026,,PLAISANCE,B487,72440,72382,Volnay,72,,,723820000A0174,,,,,,,,,,,,,0,1,Maison,10,1,S,sols,,,268,0.452316,47.962994
2020-1016561,2020-12-28,000001,Vente,10000,,,LANDE DE BEL AIRS,B365,72440,72382,Volnay,72,,,723820000A0175,,,,,,,,,,,,,0,,,,,T,terres,,,2172,0.452295,47.962713
2020-1016672,2020-12-30,000001,Vente,182000,5,,LES FORGES,B264,72440,72382,Volnay,72,,,723820000A0420,,,,,,,,,,,,,0,3,Dépendance,,0,S,sols,,,615,0.468279,47.96578
2020-1016672,2020-12-30,000001,Vente,182000,5,,LES FORGES,B264,72440,72382,Volnay,72,,,723820000A0420,,,,,,,,,,,,,0,1,Maison,110,5,S,sols,,,615,0.468279,47.96578
2020-1016672,2020-12-30,000001,Vente,182000,,,LE JARDIN,B338,72440,72382,Volnay,72,,,723820000A0421,,,,,,,,,,,,,0,,,,,AG,terrains d'agrément,,,2592,0.468238,47.965958
2020-1016672,2020-12-30,000001,Vente,182000,,,LES FORGES,B264,72440,72382,Volnay,72,,,723820000A1010,,,,,,,,,,,,,0,,,,,S,sols,,,206,0.468195,47.965669
2020-1016744,2020-12-21,000002,Vente,140000,,,JARDIN DERRIERE LA MAISON,B347,72440,72382,Volnay,72,,,723820000B1107,,,,,,,,,,,,,0,,,,,P,prés,,,501,,
2020-1016744,2020-12-21,000002,Vente,140000,,,LES RATIERS,B554,72440,72382,Volnay,72,,,723820000B1110,,,,,,,,,,,,,0,,,,,S,sols,,,637,,
2020-1016744,2020-12-21,000002,Vente,140000,,,LE JARDIN,B338,72440,72382,Volnay,72,,,723820000B1112,,,,,,,,,,,,,0,,,,,P,prés,,,2,,
2020-1016756,2020-12-22,000001,Vente,470000,,,LE CLOS,B220,72440,72382,Volnay,72,,,723820000B0045,,,,,,,,,,,,,0,,,,,T,terres,,,25300,0.498481,47.950588
2020-1016756,2020-12-22,000001,Vente,470000,,,CHAMP DE LA TAILLE,B119,72440,72382,Volnay,72,,,723820000B0048,,,,,,,,,,,,,0,,,,,T,terres,,,11400,0.497588,47.949087
2020-1016756,2020-12-22,000001,Vente,470000,,,LE PETIT CLOS,B436,72440,72382,Volnay,72,,,723820000B0049,,,,,,,,,,,,,0,,,,,T,terres,,,22200,0.499773,47.949247
2020-1016756,2020-12-22,000001,Vente,470000,,,CHAMP LONG,B189,72440,72382,Volnay,72,,,723820000B0050,,,,,,,,,,,,,0,,,,,P,prés,,,33091,0.499847,47.948079
2020-1016756,2020-12-22,000001,Vente,470000,,,CHAMP DU CLIN,B156,72440,72382,Volnay,72,,,723820000B0051,,,,,,,,,,,,,0,,,,,T,terres,,,43484,0.500937,47.947737
2020-1016756,2020-12-22,000001,Vente,470000,,,CHAMP DU CLIN,B156,72440,72382,Volnay,72,,,723820000B0052,,,,,,,,,,,,,0,,,,,BT,taillis simples,,,240,0.499005,47.946078
2020-1016756,2020-12-22,000001,Vente,470000,,,LES RATIERS,B554,72440,72382,Volnay,72,,,723820000B0053,,,,,,,,,,,,,0,,,,,P,prés,,,1046,0.498805,47.947199
2020-1016756,2020-12-22,000001,Vente,470000,,,LE JARDIN,B338,72440,72382,Volnay,72,,,723820000B0057,,,,,,,,,,,,,0,,,,,P,prés,,,1759,0.497434,47.948013
2020-1016756,2020-12-22,000001,Vente,470000,,,LE JARDIN,B338,72440,72382,Volnay,72,,,723820000B0057,,,,,,,,,,,,,0,,,,,S,sols,,,21,0.497434,47.948013
2020-1016756,2020-12-22,000001,Vente,470000,,,CHAMP DE LA MARE,B104,72440,72382,Volnay,72,,,723820000B0058,,,,,,,,,,,,,0,,,,,T,terres,,,19114,0.497081,47.94718
2020-1016756,2020-12-22,000001,Vente,470000,,,LE CHAMP BLANC,B062,72440,72382,Volnay,72,,,723820000B0059,,,,,,,,,,,,,0,,,,,P,prés,,,26840,0.497872,47.946563
2020-1016756,2020-12-22,000001,Vente,470000,,,LE CHAMP BLANC,B062,72440,72382,Volnay,72,,,723820000B0060,,,,,,,,,,,,,0,,,,,P,prés,,,11468,0.496597,47.946015
2020-1016756,2020-12-22,000001,Vente,470000,,,LE CHAMP BLANC,B062,72440,72382,Volnay,72,,,723820000B0061,,,,,,,,,,,,,0,,,,,P,prés,,,1513,0.49624,47.946582
2020-1016756,2020-12-22,000001,Vente,470000,,,LE CHAMP BLANC,B062,72440,72382,Volnay,72,,,723820000B0062,,,,,,,,,,,,,0,,,,,P,prés,,,3251,0.495917,47.946501
2020-1016756,2020-12-22,000001,Vente,470000,,,LE TAILLIS DES RATIERS,B612,72440,72382,Volnay,72,,,723820000B0069,,,,,,,,,,,,,0,,,,,BS,taillis sous futaie,,,11749,0.496447,47.947962
2020-1016756,2020-12-22,000001,Vente,470000,,,JARDIN DERRIERE LA MAISON,B347,72440,72382,Volnay,72,,,723820000B1108,,,,,,,,,,,,,0,,,,,P,prés,,,1506,0.498423,47.948366
2020-1016756,2020-12-22,000001,Vente,470000,5108,,LES RATIERS,B554,72440,72382,Volnay,72,,,723820000B1109,,,,,,,,,,,,,0,1,Maison,122,2,S,sols,,,1547,0.497859,47.948071
2020-1016756,2020-12-22,000001,Vente,470000,,,LES RATIERS,B554,72440,72382,Volnay,72,,,723820000B1111,,,,,,,,,,,,,0,,,,,S,sols,,,181,0.498197,47.948611
2020-1016756,2020-12-22,000001,Vente,470000,,,LE JARDIN,B338,72440,72382,Volnay,72,,,723820000B1113,,,,,,,,,,,,,0,,,,,P,prés,,,1422,0.497754,47.948427
2020-1017100,2020-01-30,000001,Vente,30900,,,PRE DE SARGILET,B519,72440,72382,Volnay,72,,,723820000A0493,,,,,,,,,,,,,0,,,,,E,eaux,ETANG,Etangs,3350,0.484303,47.967935
2020-1017100,2020-01-30,000001,Vente,30900,,,PRE DE SARGILET,B519,72440,72382,Volnay,72,,,723820000A0493,,,,,,,,,,,,,0,,,,,P,prés,,,3020,0.484303,47.967935
2020-1017100,2020-01-30,000001,Vente,30900,,,PLOUSE DE LA LINDENNE,B492,72440,72382,Volnay,72,,,723820000A0494,,,,,,,,,,,,,0,,,,,P,prés,,,5700,0.484488,47.966688
2020-1017100,2020-01-30,000001,Vente,30900,,,LA PLOUSE,B490,72440,72382,Volnay,72,,,723820000A0496,,,,,,,,,,,,,0,,,,,BS,taillis sous futaie,,,5994,0.484896,47.968024
2020-1017100,2020-01-30,000001,Vente,30900,,,LE PATIS,B407,72440,72382,Volnay,72,,,723820000A1143,,,,,,,,,,,,,0,,,,,P,prés,,,3607,0.484715,47.968749
2020-1017100,2020-01-30,000001,Vente,30900,,,LE PATIS,B407,72440,72382,Volnay,72,,,723820000A1143,,,,,,,,,,,,,0,,,,,E,eaux,ETANG,Etangs,4314,0.484715,47.968749
2020-1017191,2020-02-12,000001,Vente,159530,1,,LA CHAUSSEE,B210,72440,72382,Volnay,72,,,723820000A0054,,,,,,,,,,,,,0,1,Maison,135,5,S,sols,,,389,0.460572,47.972345
2020-1017191,2020-02-12,000001,Vente,159530,,,LA CHAUSSEE,B210,72440,72382,Volnay,72,,,723820000A1140,,,,,,,,,,,,,0,,,,,S,sols,,,291,0.460559,47.972238
2020-1017494,2020-05-05,000001,Vente,8000,,,JARDIN NEUF,B355,72440,72382,Volnay,72,,,723820000A0005,,,,,,,,,,,,,0,,,,,P,prés,,,8208,0.439167,47.975052
2020-1017494,2020-05-05,000001,Vente,8000,,,JARDIN NEUF,B355,72440,72382,Volnay,72,,,723820000A0005,,,,,,,,,,,,,0,,,,,S,sols,,,17,0.439167,47.975052
2020-1017494,2020-05-05,000001,Vente,8000,,,LE FRENE,B274,72440,72382,Volnay,72,,,723820000A0751,,,,,,,,,,,,,0,,,,,S,sols,,,75,0.437817,47.975114
2020-1017494,2020-05-05,000001,Vente,8000,,,LE GRAND PRE,B299,72440,72382,Volnay,72,,,723820000A1027,,,,,,,,,,,,,0,,,,,P,prés,,,2435,0.440434,47.974679
2020-1017684,2020-05-25,000001,Vente,14000,5317,,LE PRE DU GUE DE FORGE,B536,72440,72382,Volnay,72,,,723820000A0271,,,,,,,,,,,,,0,3,Dépendance,,0,S,sols,,,16,0.468939,47.973271
2020-1017684,2020-05-25,000001,Vente,14000,5317,,LE PRE DU GUE DE FORGE,B536,72440,72382,Volnay,72,,,723820000A0271,,,,,,,,,,,,,0,3,Dépendance,,0,AG,terrains d'agrément,,,1473,0.468939,47.973271
2020-1017684,2020-05-25,000001,Vente,14000,5317,,LE PRE DU GUE DE FORGE,B536,72440,72382,Volnay,72,,,723820000A0271,,,,,,,,,,,,,0,3,Dépendance,,0,E,eaux,ETANG,Etangs,1011,0.468939,47.973271
2020-1017684,2020-05-25,000001,Vente,14000,,,CHAMP DES SAPINS,B145,72440,72382,Volnay,72,,,723820000A1112,,,,,,,,,,,,,0,,,,,T,terres,,,487,0.469113,47.973062
2020-1017851,2020-05-27,000001,Vente,3000,,,LA SAPINIERE DE L ETANG,B576,72440,72382,Volnay,72,,,723820000B0828,,,,,,,,,,,,,0,,,,,BS,taillis sous futaie,,,3329,0.475713,47.924025
2020-1017851,2020-05-27,000001,Vente,3000,,,LA SAPINIERE DE L ETANG,B576,72440,72382,Volnay,72,,,723820000B0830,,,,,,,,,,,,,0,,,,,T,terres,,,1577,0.476868,47.923725
2020-1017926,2020-06-08,000001,Vente,210000,39,,RUE PRINCIPALE,0112,72440,72382,Volnay,72,,,723820000C0632,,,,,,,,,,,,,0,3,Dépendance,,0,S,sols,,,542,0.46609,47.934491
2020-1017926,2020-06-08,000001,Vente,210000,39,,RUE PRINCIPALE,0112,72440,72382,Volnay,72,,,723820000C0632,,,,,,,,,,,,,0,1,Maison,90,3,AG,terrains d'agrément,,,333,0.46609,47.934491
2020-1017926,2020-06-08,000001,Vente,210000,39,,RUE PRINCIPALE,0112,72440,72382,Volnay,72,,,723820000C0632,,,,,,,,,,,,,0,3,Dépendance,,0,AG,terrains d'agrément,,,333,0.46609,47.934491
2020-1017926,2020-06-08,000001,Vente,210000,39,,RUE PRINCIPALE,0112,72440,72382,Volnay,72,,,723820000C0632,,,,,,,,,,,,,0,1,Maison,90,3,S,sols,,,542,0.46609,47.934491
2020-1017926,2020-06-08,000001,Vente,210000,,,PRE DE VOLNAY,B520,72440,72382,Volnay,72,,,723820000C0749,,,,,,,,,,,,,0,,,,,BR,futaies résineuses,PIN,Pins,885,0.464972,47.933622
2020-1017926,2020-06-08,000001,Vente,210000,,,LES PLANCHETTES,B488,72440,72382,Volnay,72,,,723820000C1169,,,,,,,,,,,,,0,,,,,S,sols,,,528,0.466503,47.934611
2020-1017926,2020-06-08,000001,Vente,210000,,,PRE DE VOLNAY,B520,72440,72382,Volnay,72,,,723820000C1238,,,,,,,,,,,,,0,,,,,P,prés,,,3638,0.464782,47.934228
2020-1017926,2020-06-08,000001,Vente,210000,,,PRE DE VOLNAY,B520,72440,72382,Volnay,72,,,723820000C1239,,,,,,,,,,,,,0,,,,,P,prés,,,2306,0.464864,47.933933
2020-1017926,2020-06-08,000001,Vente,210000,,,LE BOURG,B040,72440,72382,Volnay,72,,,723820000C1257,,,,,,,,,,,,,0,,,,,P,prés,,,96,0.465751,47.93407
2020-1017926,2020-06-08,000001,Vente,210000,,,PRE DE VOLNAY,B520,72440,72382,Volnay,72,,,723820000C1260,,,,,,,,,,,,,0,,,,,P,prés,,,1951,0.465375,47.933725
2020-1017926,2020-06-08,000001,Vente,210000,,,LE PRE,B501,72440,72382,Volnay,72,,,723820000C1323,,,,,,,,,,,,,0,,,,,P,prés,,,298,0.466502,47.934703
2020-1017926,2020-06-08,000001,Vente,210000,,,PRE DE VOLNAY,B520,72440,72382,Volnay,72,,,723820000C1325,,,,,,,,,,,,,0,,,,,P,prés,,,7432,0.464884,47.93475
2020-1018157,2020-07-06,000001,Vente,138000,,,LA CHAUSSEE,B210,72440,72382,Volnay,72,,,723820000A0049,,,,,,,,,,,,,0,,,,,P,prés,,,661,0.460503,47.973045
2020-1018157,2020-07-06,000001,Vente,138000,,,LA CHAUSSEE,B210,72440,72382,Volnay,72,,,723820000A0049,,,,,,,,,,,,,0,,,,,E,eaux,ETANG,Etangs,660,0.460503,47.973045
2020-1018157,2020-07-06,000001,Vente,138000,5004,,LA CHAUSSEE,B210,72440,72382,Volnay,72,,,723820000A0052,,,,,,,,,,,,,0,1,Maison,120,5,S,sols,,,1137,0.460448,47.972841
2020-1018161,2020-07-08,000001,Vente,27000,2,,IMP DU PONT,0114,72440,72382,Volnay,72,,,723820000C0507,,,,,,,,,,,,,0,1,Maison,65,3,S,sols,,,1407,0.466164,47.930841
2020-1018215,2020-08-03,000001,Vente,65000,23,,RUE PRINCIPALE,0112,72440,72382,Volnay,72,,,723820000C0710,,,,,,,,,,,,,0,1,Maison,75,3,S,sols,,,350,0.466588,47.933246
2020-1018215,2020-08-03,000001,Vente,65000,,,LE JARDIN,B338,72440,72382,Volnay,72,,,723820000C0740,,,,,,,,,,,,,0,,,,,J,jardins,,,865,0.466269,47.933304
2020-1018215,2020-08-03,000001,Vente,65000,5383,,PRE DU BAS JARDIN,B530,72440,72382,Volnay,72,,,723820000C0741,,,,,,,,,,,,,0,3,Dépendance,,0,P,prés,,,615,0.465772,47.933181
2020-1018215,2020-08-03,000001,Vente,65000,5383,,PRE DU BAS JARDIN,B530,72440,72382,Volnay,72,,,723820000C0741,,,,,,,,,,,,,0,3,Dépendance,,0,S,sols,,,500,0.465772,47.933181
2020-1018286,2020-07-22,000001,Vente,64450,5042,,LE GUE DE FORGE,B327,72440,72382,Volnay,72,,,723820000A0296,,,,,,,,,,,,,0,1,Maison,94,4,S,sols,,,1240,0.472681,47.97143
2020-1018286,2020-07-22,000001,Vente,64450,,,CHAMP DU FOUR,B160,72440,72382,Volnay,72,,,723820000A0297,,,,,,,,,,,,,0,,,,,P,prés,,,3229,0.473075,47.970952
2020-1018286,2020-07-22,000001,Vente,64450,,,CHAMP DU FOUR,B160,72440,72382,Volnay,72,,,723820000A0297,,,,,,,,,,,,,0,,,,,S,sols,,,2412,0.473075,47.970952
2020-1018286,2020-07-22,000001,Vente,64450,,,CHAMP DE LA CURE,B094,72440,72382,Volnay,72,,,723820000A0298,,,,,,,,,,,,,0,,,,,T,terres,,,8641,0.472494,47.970568
2020-1018286,2020-07-22,000001,Vente,64450,,,LA POINTE,B495,72440,72382,Volnay,72,,,723820000A0299,,,,,,,,,,,,,0,,,,,T,terres,,,6680,0.472402,47.969905
2020-1018286,2020-07-22,000001,Vente,64450,,,CHAMP DU CARREFOUR,B151,72440,72382,Volnay,72,,,723820000A0300,,,,,,,,,,,,,0,,,,,T,terres,,,10795,0.472485,47.968795
2020-1018286,2020-07-22,000001,Vente,64450,,,CHAMP DU FOUR D EN BAS,B161,72440,72382,Volnay,72,,,723820000A0306,,,,,,,,,,,,,0,,,,,T,terres,,,27563,0.474231,47.970822
2020-1018286,2020-07-22,000001,Vente,64450,,,CHAMP DU FOUR,B160,72440,72382,Volnay,72,,,723820000A0307,,,,,,,,,,,,,0,,,,,P,prés,,,2000,0.472972,47.971766
2020-1018286,2020-07-22,000001,Vente,64450,,,LE PATIS,B407,72440,72382,Volnay,72,,,723820000A0308,,,,,,,,,,,,,0,,,,,E,eaux,ETANG,Etangs,893,0.47365,47.972137
2020-1018286,2020-07-22,000001,Vente,64450,,,LE PATIS,B407,72440,72382,Volnay,72,,,723820000A0308,,,,,,,,,,,,,0,,,,,P,prés,,,1847,0.47365,47.972137
2020-1018286,2020-07-22,000001,Vente,64450,,,LE GUE DE FORGE,B327,72440,72382,Volnay,72,,,723820000A1105,,,,,,,,,,,,,0,,,,,S,sols,,,261,0.472289,47.971493
2020-1018555,2020-09-11,000001,Vente,70000,21,,RTE DE SAINT MARS DE LOCQUENAY,0129,72440,72382,Volnay,72,,,723820000B0642,,,,,,,,,,,,,0,1,Maison,81,4,S,sols,,,445,0.473027,47.932276
