id_mutation,date_mutation,numero_disposition,nature_mutation,valeur_fonciere,adresse_numero,adresse_suffixe,adresse_nom_voie,adresse_code_voie,code_postal,code_commune,nom_commune,code_departement,ancien_code_commune,ancien_nom_commune,id_parcelle,ancien_id_parcelle,numero_volume,lot1_numero,lot1_surface_carrez,lot2_numero,lot2_surface_carrez,lot3_numero,lot3_surface_carrez,lot4_numero,lot4_surface_carrez,lot5_numero,lot5_surface_carrez,nombre_lots,code_type_local,type_local,surface_reelle_bati,nombre_pieces_principales,code_nature_culture,nature_culture,code_nature_culture_speciale,nature_culture_speciale,surface_terrain,longitude,latitude
2020-1021536,2020-01-23,000001,Vente,55000,,,RONDA,B029,73370,73076,La Chapelle-du-Mont-du-Chat,73,,,730760000A0377,,,,,,,,,,,,,0,,,,,AB,terrains a bâtir,,,597,5.848155,45.727614
2020-1021536,2020-01-23,000001,Vente,55000,,,RONDA,B029,73370,73076,La Chapelle-du-Mont-du-Chat,73,,,730760000A0378,,,,,,,,,,,,,0,,,,,AB,terrains a bâtir,,,493,5.848083,45.727766
2020-1022230,2020-01-31,000001,Vente,552450,5090,F,LA SERRAZ,B031,73370,73076,La Chapelle-du-Mont-du-Chat,73,,,730760000B1068,,,,,,,,,,,,,0,3,Dépendance,,0,P,prés,,,1041,5.853267,45.690897
2020-1022230,2020-01-31,000001,Vente,552450,5090,F,LA SERRAZ,B031,73370,73076,La Chapelle-du-Mont-du-Chat,73,,,730760000B1068,,,,,,,,,,,,,0,1,Maison,152,4,S,sols,,,500,5.853267,45.690897
2020-1022230,2020-01-31,000001,Vente,552450,5090,F,LA SERRAZ,B031,73370,73076,La Chapelle-du-Mont-du-Chat,73,,,730760000B1068,,,,,,,,,,,,,0,1,Maison,152,4,P,prés,,,1041,5.853267,45.690897
2020-1022230,2020-01-31,000001,Vente,552450,5090,F,LA SERRAZ,B031,73370,73076,La Chapelle-du-Mont-du-Chat,73,,,730760000B1068,,,,,,,,,,,,,0,3,Dépendance,,0,S,sols,,,500,5.853267,45.690897
2020-1023579,2020-02-24,000001,Vente,265000,5084,F,LE PETIT VILLARD,B026,73370,73076,La Chapelle-du-Mont-du-Chat,73,,,730760000A0404,,,,,,,,,,,,,0,1,Maison,135,6,S,sols,,,201,5.845946,45.72893
2020-1023579,2020-02-24,000001,Vente,265000,,,LE PETIT VILLARD,B026,73370,73076,La Chapelle-du-Mont-du-Chat,73,,,730760000A0405,,,,,,,,,,,,,0,,,,,S,sols,,,211,5.845925,45.728797
2020-1023579,2020-02-24,000001,Vente,265000,,,LE PETIT VILLARD,B026,73370,73076,La Chapelle-du-Mont-du-Chat,73,,,730760000A0406,,,,,,,,,,,,,0,,,,,L,landes,,,80,5.845961,45.728649
2020-1023579,2020-02-24,000001,Vente,265000,,,LE PETIT VILLARD,B026,73370,73076,La Chapelle-du-Mont-du-Chat,73,,,730760000A0407,,,,,,,,,,,,,0,,,,,L,landes,,,10,5.845999,45.728556
2020-1023579,2020-02-24,000001,Vente,265000,,,LE PETIT VILLARD,B026,73370,73076,La Chapelle-du-Mont-du-Chat,73,,,730760000A0869,,,,,,,,,,,,,0,,,,,S,sols,,,51,5.84597,45.728576
2020-1025137,2020-05-12,000001,Vente,1779,,,LES MARAIS,B021,73370,73076,La Chapelle-du-Mont-du-Chat,73,,,730760000B0719,,,,,,,,,,,,,0,,,,,BT,taillis simples,,,5670,5.850586,45.696892
2020-1025137,2020-05-12,000001,Vente,1779,,,LES MARAIS,B021,73370,73076,La Chapelle-du-Mont-du-Chat,73,,,730760000B1095,,,,,,,,,,,,,0,,,,,P,prés,,,619,5.851488,45.696453
2020-1025839,2020-05-05,000001,Vente,240550,,,LE PETIT VILLARD,B026,73370,73076,La Chapelle-du-Mont-du-Chat,73,,,730760000A0414,,,,,,,,,,,,,0,,,,,BT,taillis simples,,,215,5.845494,45.729062
2020-1025839,2020-05-05,000001,Vente,240550,,,CHAMP SUR LA VILLE,B005,73370,73076,La Chapelle-du-Mont-du-Chat,73,,,730760000A0419,,,,,,,,,,,,,0,,,,,BT,taillis simples,,,152,5.845081,45.728984
2020-1025839,2020-05-05,000001,Vente,240550,,,CHAMP SUR LA VILLE,B005,73370,73076,La Chapelle-du-Mont-du-Chat,73,,,730760000A0420,,,,,,,,,,,,,0,,,,,P,prés,,,701,5.845207,45.728857
2020-1025839,2020-05-05,000001,Vente,240550,,,CHAMP SUR LA VILLE,B005,73370,73076,La Chapelle-du-Mont-du-Chat,73,,,730760000A0421,,,,,,,,,,,,,0,,,,,P,prés,,,165,5.845097,45.728731
2020-1025839,2020-05-05,000001,Vente,240550,,,LE PETIT VILLARD,B026,73370,73076,La Chapelle-du-Mont-du-Chat,73,,,730760000A0704,,,,,,,,,,,,,0,,,,,BT,taillis simples,,,167,5.845432,45.728944
2020-1025839,2020-05-05,000001,Vente,240550,,,LE PETIT VILLARD,B026,73370,73076,La Chapelle-du-Mont-du-Chat,73,,,730760000A0792,,,,,,,,,,,,,0,,,,,L,landes,,,34,5.845624,45.729121
2020-1025839,2020-05-05,000001,Vente,240550,,,LE PETIT VILLARD,B026,73370,73076,La Chapelle-du-Mont-du-Chat,73,,,730760000A0794,,,,,,,,,,,,,0,,,,,S,sols,,,84,5.845465,45.729114
2020-1025839,2020-05-05,000001,Vente,240550,,,LE PETIT VILLARD,B026,73370,73076,La Chapelle-du-Mont-du-Chat,73,,,730760000A0795,,,,,,,,,,,,,0,,,,,S,sols,,,56,5.845161,45.729114
2020-1025839,2020-05-05,000001,Vente,240550,5103,F,LE PETIT VILLARD,B026,73370,73076,La Chapelle-du-Mont-du-Chat,73,,,730760000A0796,,,,,,,,,,,,,0,1,Maison,152,5,S,sols,,,265,5.845304,45.729047
2020-1026468,2020-06-15,000001,Vente,231401,5092,F,LES BALMETTES,B001,73370,73076,La Chapelle-du-Mont-du-Chat,73,,,730760000B0855,,,,,,,,,,,,,0,1,Maison,95,4,S,sols,,,66,5.853174,45.692025
2020-1026468,2020-06-15,000001,Vente,231401,,,LES BALMETTES,B001,73370,73076,La Chapelle-du-Mont-du-Chat,73,,,730760000B0856,,,,,,,,,,,,,0,,,,,S,sols,,,65,5.853151,45.691969
2020-1029195,2020-07-27,000001,Vente,578600,,,FERME PALATIN,B017,73370,73076,La Chapelle-du-Mont-du-Chat,73,,,730760000B1227,,,,,,,,,,,,,0,,,,,P,prés,,,2236,5.856506,45.695898
2020-1029195,2020-07-27,000001,Vente,578600,5073,,FERME PALATIN,B017,73370,73076,La Chapelle-du-Mont-du-Chat,73,,,730760000B1229,,,,,,,,,,,,,0,1,Maison,179,6,S,sols,,,813,5.856236,45.695873
2020-1029195,2020-07-27,000001,Vente,578600,,,FERME PALATIN,B017,73370,73076,La Chapelle-du-Mont-du-Chat,73,,,730760000B1231,,,,,,,,,,,,,0,,,,,P,prés,,,1936,5.856101,45.696027
2020-1029898,2020-08-28,000001,Vente,1500,,,LE REFRAIE,B028,73370,73076,La Chapelle-du-Mont-du-Chat,73,,,730760000B0036,,,,,,,,,,,,,0,,,,,BT,taillis simples,,,580,5.848737,45.717334
2020-1029898,2020-08-28,000001,Vente,1500,,,LE REFRAIE,B028,73370,73076,La Chapelle-du-Mont-du-Chat,73,,,730760000B0037,,,,,,,,,,,,,0,,,,,BT,taillis simples,,,3185,5.849218,45.717046
2020-1031363,2020-10-14,000002,Vente,1,,,CHAMP SUR LA VILLE,B005,73370,73076,La Chapelle-du-Mont-du-Chat,73,,,730760000A0430,,,,,,,,,,,,,0,,,,,AB,terrains a bâtir,,,35,5.846124,45.728317
2020-1031363,2020-10-14,000002,Vente,1,,,CHAMP SUR LA VILLE,B005,73370,73076,La Chapelle-du-Mont-du-Chat,73,,,730760000A0431,,,,,,,,,,,,,0,,,,,AB,terrains a bâtir,,,110,5.846202,45.728206
2020-1031363,2020-10-14,000002,Vente,1,,,LE PETIT VILLARD,B026,73370,73076,La Chapelle-du-Mont-du-Chat,73,,,730760000A0880,,,,,,,,,,,,,0,,,,,S,sols,,,48,5.846243,45.728293
2020-1031363,2020-10-14,000002,Vente,1,,,LE PETIT VILLARD,B026,73370,73076,La Chapelle-du-Mont-du-Chat,73,,,730760000A0889,,,,,,,,,,,,,0,,,,,BT,taillis simples,,,72,5.84631,45.72819
2020-1031507,2020-10-01,000001,Vente,1800,,,CHAMPS AUX PERRIERES,B006,73370,73076,La Chapelle-du-Mont-du-Chat,73,,,730760000A0532,,,,,,,,,,,,,0,,,,,L,landes,,,1125,5.847422,45.720312
2020-1031507,2020-10-01,000001,Vente,1800,,,LE REFRAIE,B028,73370,73076,La Chapelle-du-Mont-du-Chat,73,,,730760000B0008,,,,,,,,,,,,,0,,,,,BT,taillis simples,,,1790,5.85199,45.714926
2020-1031507,2020-10-01,000001,Vente,1800,,,LE REFRAIE,B028,73370,73076,La Chapelle-du-Mont-du-Chat,73,,,730760000B0028,,,,,,,,,,,,,0,,,,,L,landes,,,330,5.849567,45.716006
2020-1031507,2020-10-01,000001,Vente,1800,,,LES TRIES,B034,73370,73076,La Chapelle-du-Mont-du-Chat,73,,,730760000B0116,,,,,,,,,,,,,0,,,,,P,prés,,,385,5.849194,45.7179
2020-1031507,2020-10-01,000001,Vente,1800,,,LES TRIES,B034,73370,73076,La Chapelle-du-Mont-du-Chat,73,,,730760000B0135,,,,,,,,,,,,,0,,,,,BT,taillis simples,,,206,5.848989,45.719299
2020-1032589,2020-10-26,000002,Vente,637200,,,CHAMP COGNE,B004,73370,73076,La Chapelle-du-Mont-du-Chat,73,,,730760000A0892,,,,,,,,,,,,,0,,,,,T,terres,,,129,5.844923,45.73083
2020-1032589,2020-10-26,000002,Vente,637200,,,CHAMP COGNE,B004,73370,73076,La Chapelle-du-Mont-du-Chat,73,,,730760000A0894,,,,,,,,,,,,,0,,,,,T,terres,,,103,5.845011,45.730743
2020-1032589,2020-10-26,000002,Vente,637200,,,CHAMP COGNE,B004,73370,73076,La Chapelle-du-Mont-du-Chat,73,,,730760000A0896,,,,,,,,,,,,,0,,,,,BT,taillis simples,,,99,5.845122,45.730667
2020-1032589,2020-10-26,000002,Vente,637200,,,CHAMP COGNE,B004,73370,73076,La Chapelle-du-Mont-du-Chat,73,,,730760000A0897,,,,,,,,,,,,,0,,,,,P,prés,,,235,5.844857,45.730656
2020-1032589,2020-10-26,000002,Vente,637200,,,CHAMP COGNE,B004,73370,73076,La Chapelle-du-Mont-du-Chat,73,,,730760000A0899,,,,,,,,,,,,,0,,,,,P,prés,,,455,5.844978,45.730583
2020-1032589,2020-10-26,000002,Vente,637200,5125,F,LE PETIT VILLARD,B026,73370,73076,La Chapelle-du-Mont-du-Chat,73,,,730760000A0901,,,,,,,,,,,,,0,1,Maison,144,4,T,terres,,,474,5.844809,45.730735
2020-1032589,2020-10-26,000002,Vente,637200,5125,F,LE PETIT VILLARD,B026,73370,73076,La Chapelle-du-Mont-du-Chat,73,,,730760000A0901,,,,,,,,,,,,,0,1,Maison,122,5,T,terres,,,474,5.844809,45.730735
2020-1033981,2020-11-25,000001,Vente,250,,,LE GRAND VILLARD,B018,73370,73076,La Chapelle-du-Mont-du-Chat,73,,,730760000B0091,,,,,,,,,,,,,0,,,,,BT,taillis simples,,,230,5.851266,45.717252
2020-1034679,2020-12-02,000001,Vente,50000,,,RONDA,B029,73370,73076,La Chapelle-du-Mont-du-Chat,73,,,730760000A0382,,,,,,,,,,,,,0,,,,,P,prés,,,1855,5.847289,45.727996
