id_mutation,date_mutation,numero_disposition,nature_mutation,valeur_fonciere,adresse_numero,adresse_suffixe,adresse_nom_voie,adresse_code_voie,code_postal,code_commune,nom_commune,code_departement,ancien_code_commune,ancien_nom_commune,id_parcelle,ancien_id_parcelle,numero_volume,lot1_numero,lot1_surface_carrez,lot2_numero,lot2_surface_carrez,lot3_numero,lot3_surface_carrez,lot4_numero,lot4_surface_carrez,lot5_numero,lot5_surface_carrez,nombre_lots,code_type_local,type_local,surface_reelle_bati,nombre_pieces_principales,code_nature_culture,nature_culture,code_nature_culture_speciale,nature_culture_speciale,surface_terrain,longitude,latitude
2020-1022249,2020-01-29,000001,Vente,110000,3,,RUE DES VERNEYS,0195,73700,73285,Séez,73,,,732850000E1724,,,4,,6,,,,,,,,2,4,Local industriel. commercial ou assimilé,228,0,,,,,,6.823885,45.614535
2020-1022813,2020-01-30,000001,Vente,565000,3,,CHE DES PERRIERES,0022,73700,73285,Séez,73,,,73285000AH0426,,,,,,,,,,,,,0,1,Maison,280,7,S,sols,,,815,6.805296,45.62143
2020-1022906,2020-02-03,000001,Vente,6448,,,LES COINS,B067,73700,73285,Séez,73,,,73285000AD0028,,,,,,,,,,,,,0,,,,,P,prés,,,806,6.796628,45.62556
2020-1022906,2020-02-03,000002,Vente,6448,,,LES ETRALLES,B116,73700,73285,Séez,73,,,732850000C1847,,,,,,,,,,,,,0,,,,,P,prés,,,1250,6.799204,45.624848
2020-1023037,2020-02-25,000001,Vente,54700,5237,,LA PROVENCHERE,B256,73700,73285,Séez,73,,,732850000E0194,,,4,,,,,,,,,,1,3,Dépendance,,0,,,,,,6.830515,45.614518
2020-1023037,2020-02-25,000001,Vente,54700,5237,,LA PROVENCHERE,B256,73700,73285,Séez,73,,,732850000E0194,,,6,,,,,,,,,,1,2,Appartement,41,2,,,,,,6.830515,45.614518
2020-1023037,2020-02-25,000001,Vente,54700,5237,,LA PROVENCHERE,B256,73700,73285,Séez,73,,,732850000E0194,,,2,,,,,,,,,,1,3,Dépendance,,0,,,,,,6.830515,45.614518
2020-1023037,2020-02-25,000001,Vente,54700,5237,,LA PROVENCHERE,B256,73700,73285,Séez,73,,,732850000E0194,,,3,,,,,,,,,,1,3,Dépendance,,0,,,,,,6.830515,45.614518
2020-1023037,2020-02-25,000001,Vente,54700,5237,,LA PROVENCHERE,B256,73700,73285,Séez,73,,,732850000E0194,,,1,,,,,,,,,,1,2,Appartement,41,2,,,,,,6.830515,45.614518
2020-1023183,2020-02-14,000001,Vente,285500,36,,RUE CELESTIN FREPPAZ,0012,73700,73285,Séez,73,,,73285000AD0210,,,8,,,,,,,,,,1,3,Dépendance,,0,,,,,,6.798997,45.622922
2020-1023183,2020-02-14,000001,Vente,285500,36,,RUE CELESTIN FREPPAZ,0012,73700,73285,Séez,73,,,73285000AD0210,,,59,121.84,66,,,,,,,,2,2,Appartement,117,5,,,,,,6.798997,45.622922
2020-1023952,2020-03-05,000002,Vente,298000,4,,RUE DU MOULIN,0180,73700,73285,Séez,73,,,73285000AI0515,,,,,,,,,,,,,0,,,,,S,sols,,,234,6.810289,45.620042
2020-1023952,2020-03-05,000002,Vente,298000,,,LES MOULINS,B194,73700,73285,Séez,73,,,73285000AI0518,,,,,,,,,,,,,0,,,,,P,prés,,,130,6.810206,45.620056
2020-1023952,2020-03-05,000003,Vente,298000,4,,RUE DU MOULIN,0180,73700,73285,Séez,73,,,73285000AI0515,,,,,,,,,,,,,0,,,,,S,sols,,,234,6.810289,45.620042
2020-1023952,2020-03-05,000003,Vente,298000,,,LES MOULINS,B194,73700,73285,Séez,73,,,73285000AI0518,,,,,,,,,,,,,0,,,,,P,prés,,,130,6.810206,45.620056
2020-1024535,2020-03-09,000001,Vente,285000,7,,CHE DES PERRIERES,0022,73700,73285,Séez,73,,,73285000AH0549,,,5,116.13,,,,,,,,,1,2,Appartement,113,5,,,,,,6.80476,45.621881
2020-1024535,2020-03-09,000001,Vente,285000,6185,,LA PERRIERE,B207,73700,73285,Séez,73,,,73285000AH0550,,,,,,,,,,,,,0,3,Dépendance,,0,S,sols,,,34,6.80469,45.621979
2020-1024829,2020-05-04,000001,Vente,257000,13,,RUE DE LA FONTANETTE,0160,73700,73285,Séez,73,,,73285000AI0471,,,5,96.55,,,,,,,,,1,2,Appartement,100,5,,,,,,6.813024,45.620531
2020-1024829,2020-05-04,000001,Vente,257000,13,,RUE DE LA FONTANETTE,0160,73700,73285,Séez,73,,,73285000AI0471,,,1,,,,,,,,,,1,3,Dépendance,,0,,,,,,6.813024,45.620531
2020-1024829,2020-05-04,000001,Vente,257000,13,,RUE DE LA FONTANETTE,0160,73700,73285,Séez,73,,,73285000AI0471,,,3,,,,,,,,,,1,3,Dépendance,,0,,,,,,6.813024,45.620531
2020-1024972,2020-04-30,000001,Vente,165940,2390,,RTE DE VAL D'ISERE,0029,73700,73285,Séez,73,,,732850000E0284,,,1,105.83,8,,,,,,,,2,2,Appartement,105,4,,,,,,6.82862,45.612599
2020-1024972,2020-04-30,000001,Vente,165940,2390,,RTE DE VAL D'ISERE,0029,73700,73285,Séez,73,,,732850000E0284,,,3,,,,,,,,,,1,3,Dépendance,,0,,,,,,6.82862,45.612599
2020-1025471,2020-05-04,000001,Vente,182670,26,,RUE DES GENTIANES,0013,73700,73285,Séez,73,,,73285000AD0413,,,13,,4,,56,,,,,,3,2,Appartement,51,2,,,,,,6.80098,45.620571
2020-1025492,2020-05-26,000001,Vente,90000,6256,,LE BREUIL,B028,73700,73285,Séez,73,,,73285000AI0296,,,,,,,,,,,,,0,3,Dépendance,,0,S,sols,,,166,6.812489,45.619729
2020-1025533,2020-05-07,000001,Vente,244718,3,,RUE DE L'EGLISE,0010,73700,73285,Séez,73,,,73285000AD0144,,,15,,20,99.48,,,,,,,2,2,Appartement,99,5,,,,,,6.798866,45.623782
2020-1025592,2020-05-12,000001,Vente,487100,,,RUE DU COMBOTTIER,0007,73700,73285,Séez,73,,,73285000AD0059,,,,,,,,,,,,,0,,,,,P,prés,,,114,6.802183,45.625188
2020-1025592,2020-05-12,000001,Vente,487100,1,,CHE DU MONT,0019,73700,73285,Séez,73,,,73285000AD0829,,,,,,,,,,,,,0,3,Dépendance,,0,S,sols,,,994,6.802511,45.624988
2020-1025592,2020-05-12,000001,Vente,487100,1,,CHE DU MONT,0019,73700,73285,Séez,73,,,73285000AD0829,,,,,,,,,,,,,0,1,Maison,114,5,S,sols,,,994,6.802511,45.624988
2020-1025595,2020-05-13,000001,Vente,657895,,,MONT PERRON,B189,73700,73285,Séez,73,,,732850000D1069,,,,,,,,,,,,,0,,,,,L,landes,FRICH,Friche,132,6.823959,45.62456
2020-1025595,2020-05-13,000001,Vente,657895,5440,,MONT PERRON,B189,73700,73285,Séez,73,,,732850000D1073,,,,,,,,,,,,,0,2,Appartement,200,5,S,sols,,,253,6.824218,45.624408
2020-1025595,2020-05-13,000001,Vente,657895,5440,,MONT PERRON,B189,73700,73285,Séez,73,,,732850000D1073,,,,,,,,,,,,,0,2,Appartement,80,2,S,sols,,,253,6.824218,45.624408
2020-1025595,2020-05-13,000001,Vente,657895,,,MONT PERRON,B189,73700,73285,Séez,73,,,732850000D1076,,,,,,,,,,,,,0,,,,,S,sols,,,111,6.824387,45.624379
2020-1025595,2020-05-13,000001,Vente,657895,,,MONT PERRON,B189,73700,73285,Séez,73,,,732850000D1077,,,,,,,,,,,,,0,,,,,T,terres,,,1065,6.8244,45.624236
2020-1025595,2020-05-13,000001,Vente,657895,,,MONT PERRON,B189,73700,73285,Séez,73,,,732850000D1078,,,,,,,,,,,,,0,,,,,T,terres,,,700,6.824715,45.623931
2020-1025595,2020-05-13,000001,Vente,657895,,,MONT PERRON,B189,73700,73285,Séez,73,,,732850000D1633,,,,,,,,,,,,,0,,,,,P,prés,,,2253,6.824325,45.624712
2020-1025595,2020-05-13,000001,Vente,657895,,,MONT PERRON,B189,73700,73285,Séez,73,,,732850000D1634,,,,,,,,,,,,,0,,,,,P,prés,,,306,6.824467,45.624999
2020-1025631,2020-05-07,000002,Vente,400000,,,CHE DES EPINOIS,0011,73700,73285,Séez,73,,,73285000AD0804,,,,,,,,,,,,,0,,,,,P,prés,,,79,6.801724,45.620721
2020-1025631,2020-05-07,000002,Vente,400000,,,LES PENITENTS,B205,73700,73285,Séez,73,,,73285000AD0807,,,,,,,,,,,,,0,,,,,P,prés,,,132,6.801657,45.620731
2020-1025631,2020-05-07,000002,Vente,400000,,,LES PENITENTS,B205,73700,73285,Séez,73,,,73285000AD0845,,,,,,,,,,,,,0,,,,,S,sols,,,273,6.801775,45.620669
2020-1025691,2020-05-25,000001,Vente,291700,19,,RUE DE L'OURA,0050,73700,73285,Séez,73,,,73285000AD0676,,,10,,35,,43,,52,,,,4,2,Appartement,83,4,,,,,,6.799916,45.62413
2020-1025718,2020-05-18,000001,Vente,125000,,,CLOU BOVET,B064,73700,73285,Séez,73,,,732850000E0556,,,,,,,,,,,,,0,,,,,P,prés,,,1580,6.824969,45.614341
2020-1026107,2020-05-20,000001,Vente,169663,1,,RUE DU SIBELET,0140,73700,73285,Séez,73,,,73285000AD0001,,,36,,,,,,,,,,1,3,Dépendance,,0,,,,,,6.795801,45.626079
2020-1026107,2020-05-20,000001,Vente,169663,1,,RUE DU SIBELET,0140,73700,73285,Séez,73,,,73285000AD0001,,,108,,117,65,,,,,,,2,2,Appartement,67,3,,,,,,6.795801,45.626079
2020-1026107,2020-05-20,000001,Vente,169663,1,,RUE DU SIBELET,0140,73700,73285,Séez,73,,,73285000AD0001,,,123,,,,,,,,,,1,3,Dépendance,,0,,,,,,6.795801,45.626079
2020-1026279,2020-05-25,000001,Vente,260138,28,,RUE DES GENTIANES,0013,73700,73285,Séez,73,,,73285000AD0413,,,63,64.76,70,,87,,,,,,3,2,Appartement,64,2,,,,,,6.80098,45.620571
2020-1026567,2020-06-02,000001,Vente,398000,26,,RUE DES GENTIANES,0013,73700,73285,Séez,73,,,73285000AD0413,,,33,,6,,7,,77,,,,4,2,Appartement,108,4,,,,,,6.80098,45.620571
2020-1026704,2020-06-26,000001,Vente,210000,60,,RUE CELESTIN FREPPAZ,0012,73700,73285,Séez,73,,,73285000AD0276,,,,,,,,,,,,,0,2,Appartement,90,4,S,sols,,,115,6.799764,45.622654
2020-1026704,2020-06-26,000001,Vente,210000,60,,RUE CELESTIN FREPPAZ,0012,73700,73285,Séez,73,,,73285000AD0276,,,,,,,,,,,,,0,2,Appartement,50,3,S,sols,,,115,6.799764,45.622654
2020-1026704,2020-06-26,000001,Vente,210000,60,,RUE CELESTIN FREPPAZ,0012,73700,73285,Séez,73,,,73285000AD0276,,,,,,,,,,,,,0,4,Local industriel. commercial ou assimilé,36,0,S,sols,,,115,6.799764,45.622654
2020-1026704,2020-06-26,000001,Vente,210000,60,,RUE CELESTIN FREPPAZ,0012,73700,73285,Séez,73,,,73285000AD0276,,,,,,,,,,,,,0,3,Dépendance,,0,S,sols,,,115,6.799764,45.622654
2020-1026704,2020-06-26,000001,Vente,210000,60,,RUE CELESTIN FREPPAZ,0012,73700,73285,Séez,73,,,73285000AD0276,,,,,,,,,,,,,0,2,Appartement,50,1,S,sols,,,115,6.799764,45.622654
2020-1027011,2020-06-29,000001,Vente,325326,1,,RUE DU SIBELET,0140,73700,73285,Séez,73,,,73285000AD0001,,,110,,113,110.9,,,,,,,2,2,Appartement,110,5,,,,,,6.795801,45.626079
2020-1027011,2020-06-29,000001,Vente,325326,1,,RUE DU SIBELET,0140,73700,73285,Séez,73,,,73285000AD0001,,,20,,,,,,,,,,1,3,Dépendance,,0,,,,,,6.795801,45.626079
2020-1027011,2020-06-29,000001,Vente,325326,1,,RUE DU SIBELET,0140,73700,73285,Séez,73,,,73285000AD0001,,,119,,,,,,,,,,1,3,Dépendance,,0,,,,,,6.795801,45.626079
2020-1027162,2020-06-10,000001,Vente,150000,,,LES PENITENTS,B205,73700,73285,Séez,73,,,73285000AD0414,,,,,,,,,,,,,0,,,,,P,prés,,,555,6.800409,45.620677
2020-1027397,2020-06-12,000001,Vente,223560,1,,RUE DU SIBELET,0140,73700,73285,Séez,73,,,73285000AD0001,,,47,,,,,,,,,,1,3,Dépendance,,0,,,,,,6.795801,45.626079
2020-1027397,2020-06-12,000001,Vente,223560,1,,RUE DU SIBELET,0140,73700,73285,Séez,73,,,73285000AD0001,,,126,,192,,201,82.1,,,,,3,2,Appartement,82,4,,,,,,6.795801,45.626079
2020-1027665,2020-06-22,000001,Vente,405000,6120,,LE BREUIL,B028,73700,73285,Séez,73,,,73285000AI0133,,,,,,,,,,,,,0,1,Maison,101,4,S,sols,,,729,6.8117,45.620571
2020-1027669,2020-06-19,000001,Vente,140000,36,,RUE CELESTIN FREPPAZ,0012,73700,73285,Séez,73,,,73285000AD0210,,,43,61.94,44,39.75,,,,,,,2,4,Local industriel. commercial ou assimilé,70,0,,,,,,6.798997,45.622922
2020-1027776,2020-06-23,000001,Vente,18000,2,,RUE DU SIBELET,0140,73700,73285,Séez,73,,,73285000AD0005,,,7,,,,,,,,,,1,3,Dépendance,,0,,,,,,6.795325,45.625313
2020-1028062,2020-07-20,000001,Vente,120000,,,LONGEFOY,B170,73700,73285,Séez,73,,,732850000E1732,,,,,,,,,,,,,0,,,,,P,prés,,,1238,6.824651,45.614005
2020-1028065,2020-07-15,000001,Vente,350000,13,,RUE DES VERNEYS,0195,73700,73285,Séez,73,,,732850000E1715,,,7,,,,,,,,,,1,2,Appartement,112,3,,,,,,6.827227,45.613355
2020-1028065,2020-07-15,000001,Vente,350000,13,,RUE DES VERNEYS,0195,73700,73285,Séez,73,,,732850000E1715,,,7,,,,,,,,,,1,4,Local industriel. commercial ou assimilé,10,0,,,,,,6.827227,45.613355
2020-1028340,2020-07-03,000001,Vente,330000,28,,RUE DES GENTIANES,0013,73700,73285,Séez,73,,,73285000AD0413,,,101,,102,,68,83.32,86,,,,4,2,Appartement,88,4,,,,,,6.80098,45.620571
2020-1028416,2020-07-27,000001,Vente,2286.24,,,BOIS DE LA COTE,B022,73700,73285,Séez,73,,,732850000C0508,,,,,,,,,,,,,0,,,,,BR,futaies résineuses,,,2278,6.814765,45.627179
2020-1028416,2020-07-27,000001,Vente,2286.24,,,BOIS DE LA COTE,B022,73700,73285,Séez,73,,,732850000C0509,,,,,,,,,,,,,0,,,,,BR,futaies résineuses,,,25,6.814469,45.627133
2020-1028416,2020-07-27,000001,Vente,2286.24,,,BOIS DE LA COTE,B022,73700,73285,Séez,73,,,732850000C0510,,,,,,,,,,,,,0,,,,,BR,futaies résineuses,,,400,6.815177,45.627152
2020-1028416,2020-07-27,000001,Vente,2286.24,,,BOIS DE LA COTE,B022,73700,73285,Séez,73,,,732850000C0514,,,,,,,,,,,,,0,,,,,BR,futaies résineuses,,,2060,6.813978,45.62729
2020-1028580,2020-05-12,000001,Vente,87500,,,LE BREUIL,B028,73700,73285,Séez,73,,,73285000AI0410,,,,,,,,,,,,,0,,,,,S,sols,,,524,6.812611,45.620345
2020-1028580,2020-05-12,000001,Vente,87500,13,,RUE DE LA FONTANETTE,0160,73700,73285,Séez,73,,,73285000AI0471,,,4,,,,,,,,,,1,2,Appartement,55,3,,,,,,6.813024,45.620531
2020-1028580,2020-05-12,000001,Vente,87500,13,,RUE DE LA FONTANETTE,0160,73700,73285,Séez,73,,,73285000AI0471,,,2,,,,,,,,,,1,3,Dépendance,,0,,,,,,6.813024,45.620531
2020-1028580,2020-05-12,000001,Vente,87500,13,,RUE DE LA FONTANETTE,0160,73700,73285,Séez,73,,,73285000AI0471,,,3,,,,,,,,,,1,3,Dépendance,,0,,,,,,6.813024,45.620531
2020-1028602,2020-07-09,000001,Vente,296000,2,,RUE DE L'OURA,0050,73700,73285,Séez,73,,,73285000AD0169,,,,,,,,,,,,,0,1,Maison,117,4,S,sols,,,468,6.797551,45.624104
2020-1028870,2020-07-24,000001,Vente,172850,4,,RUE DU MOULIN,0180,73700,73285,Séez,73,,,73285000AI0514,,,,,,,,,,,,,0,2,Appartement,55,22,S,sols,,,343,6.810464,45.620054
2020-1028870,2020-07-24,000001,Vente,172850,4,,RUE DU MOULIN,0180,73700,73285,Séez,73,,,73285000AI0514,,,,,,,,,,,,,0,2,Appartement,55,3,S,sols,,,343,6.810464,45.620054
2020-1028971,2020-07-27,000001,Vente,183500,1,,RUE DU SIBELET,0140,73700,73285,Séez,73,,,73285000AD0001,,,125,,151,,160,,,,,,3,2,Appartement,61,2,,,,,,6.795801,45.626079
2020-1028971,2020-07-27,000001,Vente,183500,1,,RUE DU SIBELET,0140,73700,73285,Séez,73,,,73285000AD0001,,,45,,,,,,,,,,1,3,Dépendance,,0,,,,,,6.795801,45.626079
2020-1028997,2020-07-30,000001,Vente,445000,,,LES MAISONS,B175,73700,73285,Séez,73,,,73285000AH0669,,,,,,,,,,,,,0,,,,,P,prés,,,1,6.811136,45.621349
2020-1028997,2020-07-30,000001,Vente,445000,,,LES MAISONS,B175,73700,73285,Séez,73,,,73285000AH0670,,,,,,,,,,,,,0,,,,,P,prés,,,16,6.811098,45.621285
2020-1028997,2020-07-30,000001,Vente,445000,2,,IMP DES MAISONS,0130,73700,73285,Séez,73,,,73285000AH0674,,,,,,,,,,,,,0,,,,,S,sols,,,248,6.810966,45.621508
2020-1028997,2020-07-30,000001,Vente,445000,,,LES MAISONS,B175,73700,73285,Séez,73,,,73285000AH0675,,,,,,,,,,,,,0,,,,,VE,vergers,,,119,6.810727,45.621343
2020-1028997,2020-07-30,000001,Vente,445000,,,LES MAISONS,B175,73700,73285,Séez,73,,,73285000AH0676,,,,,,,,,,,,,0,,,,,VE,vergers,,,134,6.810809,45.621306
2020-1028997,2020-07-30,000001,Vente,445000,,,LES MAISONS,B175,73700,73285,Séez,73,,,73285000AH0677,,,,,,,,,,,,,0,,,,,VE,vergers,,,197,6.811039,45.621303
2020-1028997,2020-07-30,000001,Vente,445000,,,LES MAISONS,B175,73700,73285,Séez,73,,,73285000AH0678,,,,,,,,,,,,,0,,,,,VE,vergers,,,145,6.810933,45.621401
2020-1028997,2020-07-30,000001,Vente,445000,,,LES MAISONS,B175,73700,73285,Séez,73,,,73285000AH0680,,,,,,,,,,,,,0,,,,,P,prés,,,394,6.810521,45.621182
2020-1028997,2020-07-30,000001,Vente,445000,,,LES MAISONS,B175,73700,73285,Séez,73,,,73285000AH0681,,,,,,,,,,,,,0,,,,,P,prés,,,366,6.810746,45.621217
2020-1028997,2020-07-30,000001,Vente,445000,,,LES MAISONS,B175,73700,73285,Séez,73,,,73285000AH0682,,,,,,,,,,,,,0,,,,,P,prés,,,290,6.810985,45.621172
2020-1029105,2020-08-06,000003,Echange,18,,,VILLARD DESSUS,B330,73700,73285,Séez,73,,,73285000AE0394,,,,,,,,,,,,,0,,,,,P,prés,,,10,6.812144,45.625791
2020-1029115,2020-07-31,000001,Vente,338000,20,,RUE FAUBOURG ST JEAN BAPTISTE,0015,73700,73285,Séez,73,,,73285000AD0363,,,,,,,,,,,,,0,2,Appartement,140,3,S,sols,,,389,6.801332,45.623285
2020-1029115,2020-07-31,000001,Vente,338000,20,,RUE FAUBOURG ST JEAN BAPTISTE,0015,73700,73285,Séez,73,,,73285000AD0363,,,,,,,,,,,,,0,2,Appartement,20,1,S,sols,,,389,6.801332,45.623285
2020-1029115,2020-07-31,000001,Vente,338000,,,RUE FAUBOURG ST JEAN BAPTISTE,0015,73700,73285,Séez,73,,,73285000AD0641,,,,,,,,,,,,,0,,,,,J,jardins,,,327,6.801335,45.62307
2020-1029150,2020-08-05,000001,Vente,175000,4,,RUE DU MOULIN,0180,73700,73285,Séez,73,,,73285000AI0516,,,,,,,,,,,,,0,,,,,P,prés,,,8,6.810283,45.619942
2020-1029150,2020-08-05,000001,Vente,175000,,,LES MOULINS,B194,73700,73285,Séez,73,,,73285000AI0517,,,,,,,,,,,,,0,,,,,P,prés,,,1541,6.810257,45.619695
2020-1029257,2020-08-13,000001,Vente,19155,,,LES ETRALLES DE SEEZ,B117,73700,73285,Séez,73,,,732850000C1163,,,,,,,,,,,,,0,,,,,P,prés,,,1555,6.802621,45.626914
2020-1029257,2020-08-13,000001,Vente,19155,,,LES ETRALLES DE SEEZ,B117,73700,73285,Séez,73,,,732850000C1164,,,,,,,,,,,,,0,,,,,BR,futaies résineuses,,,1005,6.80253,45.627146
2020-1029257,2020-08-13,000001,Vente,19155,,,LES ETRALLES,B116,73700,73285,Séez,73,,,732850000C1863,,,,,,,,,,,,,0,,,,,P,prés,,,1135,6.800646,45.626509
2020-1030294,2020-08-25,000001,Vente,145000,6116,,RUE CELESTIN FREPPAZ,0012,73700,73285,Séez,73,,,73285000AD0336,,,2,,,,,,,,,,1,3,Dépendance,,0,,,,,,6.800965,45.622312
2020-1030294,2020-08-25,000001,Vente,145000,6116,,RUE CELESTIN FREPPAZ,0012,73700,73285,Séez,73,,,73285000AD0336,,,15,,25,54.39,,,,,,,2,2,Appartement,54,2,,,,,,6.800965,45.622312
2020-1030956,2020-09-14,000001,Vente,188000,3,,RUE DE L'EGLISE,0010,73700,73285,Séez,73,,,73285000AD0144,,,18,53.69,,,,,,,,,1,2,Appartement,54,2,,,,,,6.798866,45.623782
2020-1030956,2020-09-14,000001,Vente,188000,3,,RUE DE L'EGLISE,0010,73700,73285,Séez,73,,,73285000AD0144,,,4,,,,,,,,,,1,3,Dépendance,,0,,,,,,6.798866,45.623782
2020-1031031,2020-09-25,000001,Vente,318000,1,,ALL DU GENEPY,0033,73700,73285,Séez,73,,,73285000AC0100,,,,,,,,,,,,,0,1,Maison,75,4,S,sols,,,440,6.794881,45.621462
2020-1031031,2020-09-25,000001,Vente,318000,,,LES CONTAMINES,B080,73700,73285,Séez,73,,,73285000AC0169,,,,,,,,,,,,,0,,,,,P,prés,,,163,6.794722,45.621313
2020-1032835,2020-10-16,000001,Vente,343275,5065,A,IMM TSANTELEINA,A055,73700,73285,Séez,73,,,73285000AD0255,,,65,,,,,,,,,,1,2,Appartement,105,3,,,,,,6.799645,45.621769
2020-1032835,2020-10-16,000001,Vente,343275,5065,A,IMM TSANTELEINA,A055,73700,73285,Séez,73,,,73285000AD0255,,,63,,,,,,,,,,1,3,Dépendance,,0,,,,,,6.799645,45.621769
2020-1034042,2020-11-16,000001,Vente,25000,2,,RUE DU SIBELET,0140,73700,73285,Séez,73,,,73285000AD0005,,,6,,,,,,,,,,1,3,Dépendance,,0,,,,,,6.795325,45.625313
2020-1034340,2020-11-23,000001,Vente,75000,29,,RUE DE LA FONTANETTE,0160,73700,73285,Séez,73,,,73285000AH0141,,,3,,5,86.73,,,,,,,2,2,Appartement,88,3,,,,,,6.811072,45.622588
2020-1034345,2020-11-23,000001,Vente,550000,29,,RUE DE LA FONTANETTE,0160,73700,73285,Séez,73,,,73285000AH0141,,,4,52.36,,,,,,,,,1,2,Appartement,54,1,,,,,,6.811072,45.622588
2020-1034345,2020-11-23,000001,Vente,550000,29,,RUE DE LA FONTANETTE,0160,73700,73285,Séez,73,,,73285000AH0141,,,6,135.76,,,,,,,,,1,2,Appartement,140,5,,,,,,6.811072,45.622588
2020-1034345,2020-11-23,000001,Vente,550000,29,,RUE DE LA FONTANETTE,0160,73700,73285,Séez,73,,,73285000AH0141,,,11,,12,,,,,,,,2,3,Dépendance,,0,,,,,,6.811072,45.622588
2020-1034345,2020-11-23,000001,Vente,550000,29,,RUE DE LA FONTANETTE,0160,73700,73285,Séez,73,,,73285000AH0141,,,2,38.52,,,,,,,,,1,2,Appartement,40,1,,,,,,6.811072,45.622588
2020-1034354,2020-11-20,000002,Vente,135520,,,LES GLIERES D EN BAS,B137,73700,73285,Séez,73,,,73285000AC0254,,,,,,,,,,,,,0,,,,,P,prés,,,834,6.79071,45.622074
2020-1034544,2020-12-10,000001,Vente,236175,26,,RUE DE LA FONTANETTE,0160,73700,73285,Séez,73,,,73285000AI0182,,,,,,,,,,,,,0,1,Maison,97,5,S,sols,,,1044,6.813073,45.621122
2020-1034544,2020-12-10,000001,Vente,236175,26,,RUE DE LA FONTANETTE,0160,73700,73285,Séez,73,,,73285000AI0182,,,,,,,,,,,,,0,3,Dépendance,,0,S,sols,,,1044,6.813073,45.621122
2020-1034756,2020-12-02,000001,Vente,7240,,,VILLARD DESSUS,B330,73700,73285,Séez,73,,,73285000AE0198,,,,,,,,,,,,,0,,,,,J,jardins,,,98,6.811804,45.627981
2020-1034756,2020-12-02,000001,Vente,7240,,,VILLARD DESSUS,B330,73700,73285,Séez,73,,,73285000AE0199,,,,,,,,,,,,,0,,,,,P,prés,,,626,6.811631,45.627879
2020-1035676,2020-12-22,000001,Vente,15000,17,,RUE DE L'OURA,0050,73700,73285,Séez,73,,,73285000AD0676,,,36,,,,,,,,,,1,3,Dépendance,,0,,,,,,6.799916,45.62413
2020-1035828,2020-12-18,000001,Vente,123500,4,,RUE DU SIBELET,0140,73700,73285,Séez,73,,,73285000AD0005,,,46,,59,,,,,,,,2,2,Appartement,52,2,,,,,,6.795325,45.625313
2020-1035838,2020-12-17,000001,Vente,198020,643,,RTE DE VAL D'ISERE,0029,73700,73285,Séez,73,,,73285000AI0441,,,11,,15,,5,,6,,9,,5,3,Dépendance,,0,,,,,,6.808178,45.618728
2020-1035838,2020-12-17,000001,Vente,198020,643,,RTE DE VAL D'ISERE,0029,73700,73285,Séez,73,,,73285000AI0441,,,11,,15,,5,,6,,9,,5,2,Appartement,83,4,,,,,,6.808178,45.618728
2020-1035838,2020-12-17,000001,Vente,198020,643,,RTE DE VAL D'ISERE,0029,73700,73285,Séez,73,,,73285000AI0441,,,11,,15,,5,,6,,9,,5,3,Dépendance,,0,,,,,,6.808178,45.618728
2020-1035878,2020-12-17,000001,Vente,448,,,LA COMBE DU CARRO,B071,73700,73285,Séez,73,,,732850000A0466,,,,,,,,,,,,,0,,,,,T,terres,,,1180,6.82048,45.640161
2020-1035878,2020-12-17,000001,Vente,448,,,TRELAROCHE,B316,73700,73285,Séez,73,,,732850000A0664,,,,,,,,,,,,,0,,,,,PA,pâtures,PATUR,Pâture plantée,1060,6.813458,45.638818
2020-1035884,2020-12-17,000001,Vente,10003.4,,,SAINT GERMAIN,B274,73700,73285,Séez,73,,,732850000A0125,,,,,,,,,,,,,0,,,,,P,prés,,,55,6.817264,45.636659
2020-1035884,2020-12-17,000001,Vente,10003.4,,,LA FLECHE,B121,73700,73285,Séez,73,,,732850000A0254,,,,,,,,,,,,,0,,,,,T,terres,,,765,6.82026,45.639489
2020-1035884,2020-12-17,000001,Vente,10003.4,,,FEUDAVID,B120,73700,73285,Séez,73,,,732850000A0259,,,,,,,,,,,,,0,,,,,P,prés,,,1375,6.819554,45.639911
2020-1035884,2020-12-17,000001,Vente,10003.4,,,LE TRU,B321,73700,73285,Séez,73,,,732850000A0351,,,,,,,,,,,,,0,,,,,P,prés,,,760,6.820147,45.641322
2020-1035884,2020-12-17,000001,Vente,10003.4,,,LE TRU,B321,73700,73285,Séez,73,,,732850000A0352,,,,,,,,,,,,,0,,,,,P,prés,,,605,6.820158,45.641127
2020-1035884,2020-12-17,000001,Vente,10003.4,,,LE TRU,B321,73700,73285,Séez,73,,,732850000A0362,,,,,,,,,,,,,0,,,,,P,prés,,,590,6.818953,45.641338
2020-1035884,2020-12-17,000001,Vente,10003.4,,,SOUS PRACHOUX,B286,73700,73285,Séez,73,,,732850000A0394,,,,,,,,,,,,,0,,,,,P,prés,,,1005,6.821435,45.6406
2020-1035884,2020-12-17,000001,Vente,10003.4,,,SOUS PRACHOUX,B286,73700,73285,Séez,73,,,732850000A0399,,,,,,,,,,,,,0,,,,,P,prés,,,995,6.821123,45.641548
2020-1035884,2020-12-17,000001,Vente,10003.4,,,SOUS PRACHOUX,B286,73700,73285,Séez,73,,,732850000A0402,,,,,,,,,,,,,0,,,,,P,prés,,,655,6.820078,45.64161
2020-1035884,2020-12-17,000001,Vente,10003.4,,,SOUS PRACHOUX,B286,73700,73285,Séez,73,,,732850000A0404,,,,,,,,,,,,,0,,,,,P,prés,,,520,6.820343,45.641777
2020-1035884,2020-12-17,000001,Vente,10003.4,,,SOUS PRACHOUX,B286,73700,73285,Séez,73,,,732850000A0413,,,,,,,,,,,,,0,,,,,P,prés,,,555,6.821521,45.641539
2020-1035884,2020-12-17,000001,Vente,10003.4,,,SOUS PRACHOUX,B286,73700,73285,Séez,73,,,732850000A0421,,,,,,,,,,,,,0,,,,,P,prés,,,575,6.822228,45.64164
2020-1035884,2020-12-17,000001,Vente,10003.4,,,CHAMP DERRIERE,B039,73700,73285,Séez,73,,,732850000A0429,,,,,,,,,,,,,0,,,,,T,terres,,,416,6.822145,45.640769
2020-1035884,2020-12-17,000001,Vente,10003.4,,,L ILLETTAZ,B156,73700,73285,Séez,73,,,732850000A0477,,,,,,,,,,,,,0,,,,,PA,pâtures,PATUR,Pâture plantée,1200,6.821568,45.639284
2020-1035884,2020-12-17,000001,Vente,10003.4,,,LES REICHES D EN BAS,B261,73700,73285,Séez,73,,,732850000A0497,,,,,,,,,,,,,0,,,,,P,prés,,,1315,6.820313,45.637809
2020-1035884,2020-12-17,000001,Vente,10003.4,,,LE PONT,B235,73700,73285,Séez,73,,,732850000A0589,,,,,,,,,,,,,0,,,,,P,prés,,,80,6.817758,45.634666
2020-1035884,2020-12-17,000001,Vente,10003.4,,,LE PONT,B235,73700,73285,Séez,73,,,732850000A0601,,,,,,,,,,,,,0,,,,,P,prés,,,870,6.817634,45.634745
2020-1035884,2020-12-17,000001,Vente,10003.4,,,CHAMP DU LIEVRE,B042,73700,73285,Séez,73,,,732850000A0702,,,,,,,,,,,,,0,,,,,T,terres,,,595,6.80911,45.637059
2020-1035884,2020-12-17,000001,Vente,10003.4,,,PRE DU COEUR,B249,73700,73285,Séez,73,,,732850000B0297,,,,,,,,,,,,,0,,,,,PA,pâtures,PATUR,Pâture plantée,2745,6.818397,45.650793
2020-1035884,2020-12-17,000001,Vente,10003.4,,,PRE DU COEUR,B249,73700,73285,Séez,73,,,732850000B0304,,,,,,,,,,,,,0,,,,,PA,pâtures,PATUR,Pâture plantée,2660,6.81909,45.650244
2020-1035884,2020-12-17,000001,Vente,10003.4,,,GRAND SARDIU,B146,73700,73285,Séez,73,,,732850000B0322,,,,,,,,,,,,,0,,,,,P,prés,,,2845,6.821741,45.647421