id_mutation,date_mutation,numero_disposition,nature_mutation,valeur_fonciere,adresse_numero,adresse_suffixe,adresse_nom_voie,adresse_code_voie,code_postal,code_commune,nom_commune,code_departement,ancien_code_commune,ancien_nom_commune,id_parcelle,ancien_id_parcelle,numero_volume,lot1_numero,lot1_surface_carrez,lot2_numero,lot2_surface_carrez,lot3_numero,lot3_surface_carrez,lot4_numero,lot4_surface_carrez,lot5_numero,lot5_surface_carrez,nombre_lots,code_type_local,type_local,surface_reelle_bati,nombre_pieces_principales,code_nature_culture,nature_culture,code_nature_culture_speciale,nature_culture_speciale,surface_terrain,longitude,latitude
2020-1036699,2020-01-07,000002,Vente,360,322,,AV FER A CHEVAL,0175,74380,74040,Bonne,74,,,740400000B4521,,,,,,,,,,,,,0,,,,,S,sols,,,36,6.325881,46.166277
2020-1037017,2020-01-20,000001,Vente,430840,184,,CHE DES PRES POTEX,0305,74380,74040,Bonne,74,,,740400000B3907,,,,,,,,,,,,,0,1,Maison,101,4,S,sols,,,1154,6.338586,46.166388
2020-1037026,2020-01-03,000001,Vente,20000,233,,AV DU LEMAN,0225,74380,74040,Bonne,74,,,740400000B4046,,,29,,,,,,,,,,1,3,Dépendance,,0,,,,,,6.31892,46.168195
2020-1037039,2020-01-21,000001,Vente,385740,490,,RTE DES CHAVANNES,0065,74380,74040,Bonne,74,,,740400000B1665,,,,,,,,,,,,,0,1,Maison,91,3,S,sols,,,1118,6.317432,46.173723
2020-1037838,2020-02-05,000001,Vente,150000,90,,RTE DES ALLUAZ,0001,74380,74040,Bonne,74,,,740400000B3294,,,3,,96,40.2,,,,,,,2,2,Appartement,40,2,,,,,,6.320788,46.168047
2020-1038168,2020-02-05,000001,Vente,112000,1530,,RTE DE LIMARGUE,0230,74380,74040,Bonne,74,,,740400000A0813,,,,,,,,,,,,,0,3,Dépendance,,0,S,sols,,,315,6.335051,46.175198
2020-1038168,2020-02-05,000001,Vente,112000,,,LIMARGUE,B082,74380,74040,Bonne,74,,,740400000A0814,,,,,,,,,,,,,0,,,,,PP,prés plantes,,,177,6.335122,46.175115
2020-1038168,2020-02-05,000001,Vente,112000,,,LIMARGUE,B082,74380,74040,Bonne,74,,,740400000A1076,,,,,,,,,,,,,0,,,,,PP,prés plantes,,,115,6.334974,46.174992
2020-1038168,2020-02-05,000001,Vente,112000,,,LIMARGUE,B082,74380,74040,Bonne,74,,,740400000A1194,,,,,,,,,,,,,0,,,,,PP,prés plantes,,,214,6.334725,46.17499
2020-1038296,2020-02-25,000001,Vente,199600,84,,IMP DU PRE JONZIER,0298,74380,74040,Bonne,74,,,740400000B3295,,,10,,22,66.59,,,,,,,2,2,Appartement,45,2,,,,,,6.317044,46.168485
2020-1038296,2020-02-25,000001,Vente,199600,84,,IMP DU PRE JONZIER,0298,74380,74040,Bonne,74,,,740400000B3295,,,23,,,,,,,,,,1,2,Appartement,22,1,,,,,,6.317044,46.168485
2020-1038308,2020-03-06,000001,Vente,514000,,,LIMARGUE,B082,74380,74040,Bonne,74,,,740400000A0825,,,,,,,,,,,,,0,,,,,J,jardins,,,642,6.334225,46.174472
2020-1038308,2020-03-06,000001,Vente,514000,,,LIMARGUE,B082,74380,74040,Bonne,74,,,740400000A1077,,,,,,,,,,,,,0,,,,,S,sols,,,783,6.334645,46.174704
2020-1038308,2020-03-06,000001,Vente,514000,1474,,RTE DE LIMARGUE,0230,74380,74040,Bonne,74,,,740400000A1196,,,,,,,,,,,,,0,2,Appartement,116,4,S,sols,,,298,6.334415,46.174708
2020-1038308,2020-03-06,000001,Vente,514000,1474,,RTE DE LIMARGUE,0230,74380,74040,Bonne,74,,,740400000A1196,,,,,,,,,,,,,0,3,Dépendance,,0,S,sols,,,298,6.334415,46.174708
2020-1038308,2020-03-06,000001,Vente,514000,1474,,RTE DE LIMARGUE,0230,74380,74040,Bonne,74,,,740400000A1196,,,,,,,,,,,,,0,3,Dépendance,,0,S,sols,,,298,6.334415,46.174708
2020-1038308,2020-03-06,000001,Vente,514000,1474,,RTE DE LIMARGUE,0230,74380,74040,Bonne,74,,,740400000A1196,,,,,,,,,,,,,0,2,Appartement,112,4,S,sols,,,298,6.334415,46.174708
2020-1038828,2020-03-11,000001,Vente en l'état futur d'achèvement,309000,,,LES LOCIRES,B083,74380,74040,Bonne,74,,,740400000B0644,,,98,,,,,,,,,,1,3,Dépendance,,0,,,,,,6.318624,46.169257
2020-1038828,2020-03-11,000001,Vente en l'état futur d'achèvement,309000,278,,AV DU LEMAN,0225,74380,74040,Bonne,74,,,740400000B0644,,,8,,,,,,,,,,1,2,Appartement,84,4,,,,,,6.318624,46.169257
2020-1038828,2020-03-11,000001,Vente en l'état futur d'achèvement,309000,278,,AV DU LEMAN,0225,74380,74040,Bonne,74,,,740400000B0644,,,78,,,,,,,,,,1,3,Dépendance,,0,,,,,,6.318624,46.169257
2020-1039185,2020-03-10,000002,Vente,830,105,,RUE DU BIEF,0020,74380,74040,Bonne,74,,,740400000B4523,,,,,,,,,,,,,0,,,,,S,sols,,,83,6.323204,46.166556
2020-1039186,2020-03-10,000002,Vente,450,105,,RUE DU BIEF,0020,74380,74040,Bonne,74,,,740400000B4525,,,,,,,,,,,,,0,,,,,S,sols,,,45,6.322997,46.166608
2020-1039286,2020-03-25,000001,Vente,256500,233,,AV DU LEMAN,0225,74380,74040,Bonne,74,,,740400000B4046,,,2,,48,,,,,,,,2,2,Appartement,67,3,,,,,,6.31892,46.168195
2020-1039286,2020-03-25,000001,Vente,256500,233,,AV DU LEMAN,0225,74380,74040,Bonne,74,,,740400000B4046,,,24,,,,,,,,,,1,3,Dépendance,,0,,,,,,6.31892,46.168195
2020-1039447,2020-03-16,000001,Vente,205300,122,,RTE DES ALLUAZ,0001,74380,74040,Bonne,74,,,740400000B0714,,,107,62.73,,,,,,,,,1,2,Appartement,62,3,,,,,,6.321618,46.167704
2020-1039447,2020-03-16,000001,Vente,205300,122,,RTE DES ALLUAZ,0001,74380,74040,Bonne,74,,,740400000B0714,,,334,,,,,,,,,,1,3,Dépendance,,0,,,,,,6.321618,46.167704
2020-1039690,2020-04-14,000001,Vente,340000,571,,RTE DE LA CHARNIAZ,0060,74380,74040,Bonne,74,,,740400000B3997,,,,,,,,,,,,,0,1,Maison,82,5,S,sols,,,495,6.326866,46.171418
2020-1039838,2020-04-21,000001,Vente,231000,233,,AV DU LEMAN,0225,74380,74040,Bonne,74,,,740400000B4046,,,312,,,,,,,,,,1,3,Dépendance,,0,,,,,,6.31892,46.168195
2020-1039838,2020-04-21,000001,Vente,231000,233,,AV DU LEMAN,0225,74380,74040,Bonne,74,,,740400000B4046,,,22,,63,,,,,,,,2,2,Appartement,64,3,,,,,,6.31892,46.168195
2020-1039838,2020-04-21,000001,Vente,231000,233,,AV DU LEMAN,0225,74380,74040,Bonne,74,,,740400000B4046,,,40,,,,,,,,,,1,3,Dépendance,,0,,,,,,6.31892,46.168195
2020-1039974,2020-05-22,000001,Vente,299000,75,,RTE DES ALLUAZ,0001,74380,74040,Bonne,74,,,740400000B1328,,,32,,45,95.46,,,,,,,2,2,Appartement,94,5,,,,,,6.320372,46.168687
2020-1039974,2020-05-22,000001,Vente,299000,75,,RTE DES ALLUAZ,0001,74380,74040,Bonne,74,,,740400000B1328,,,4,,,,,,,,,,1,3,Dépendance,,0,,,,,,6.320372,46.168687
2020-1039974,2020-05-22,000001,Vente,299000,75,,RTE DES ALLUAZ,0001,74380,74040,Bonne,74,,,740400000B1328,,,2,,,,,,,,,,1,3,Dépendance,,0,,,,,,6.320372,46.168687
2020-1040003,2020-05-14,000001,Vente,3030,,,ASNIERES,B004,74380,74040,Bonne,74,,,740400000B4320,,,,,,,,,,,,,0,,,,,S,sols,,,101,6.325807,46.17201
2020-1040528,2020-05-20,000001,Vente,239000,575,,RTE DES ALLUAZ,0001,74380,74040,Bonne,74,,,740400000B3897,,,12,,,,,,,,,,1,3,Dépendance,,0,,,,,,6.32775,46.16858
2020-1040528,2020-05-20,000001,Vente,239000,575,,RTE DES ALLUAZ,0001,74380,74040,Bonne,74,,,740400000B3897,,,15,,25,60.68,,,,,,,2,2,Appartement,61,3,,,,,,6.32775,46.16858
2020-1040594,2020-05-11,000001,Vente,301400,557,,RTE DE LA CHARNIAZ,0060,74380,74040,Bonne,74,,,740400000B4297,,,97,,,,,,,,,,1,3,Dépendance,,0,,,,,,6.327141,46.170749
2020-1040594,2020-05-11,000001,Vente,301400,557,,RTE DE LA CHARNIAZ,0060,74380,74040,Bonne,74,,,740400000B4297,,,34,,,,,,,,,,1,3,Dépendance,,0,,,,,,6.327141,46.170749
2020-1040594,2020-05-11,000001,Vente,301400,557,,RTE DE LA CHARNIAZ,0060,74380,74040,Bonne,74,,,740400000B4297,,,66,,,,,,,,,,1,2,Appartement,81,4,,,,,,6.327141,46.170749
2020-1040716,2020-05-19,000001,Vente,208760,75,,RTE DES ALLUAZ,0001,74380,74040,Bonne,74,,,740400000B1328,,,28,,40,62.46,,,,,,,2,2,Appartement,62,3,,,,,,6.320372,46.168687
2020-1040716,2020-05-19,000001,Vente,208760,75,,RTE DES ALLUAZ,0001,74380,74040,Bonne,74,,,740400000B1328,,,12,,,,,,,,,,1,3,Dépendance,,0,,,,,,6.320372,46.168687
2020-1041046,2020-06-10,000001,Vente,200000,5236,,LIMARGUE,B082,74380,74040,Bonne,74,,,740400000A0829,,,,,,,,,,,,,0,1,Maison,24,1,S,sols,,,30,6.334698,46.175024
2020-1041046,2020-06-10,000001,Vente,200000,,,LIMARGUE,B082,74380,74040,Bonne,74,,,740400000A1682,,,,,,,,,,,,,0,,,,,P,prés,,,175,6.334685,46.175022
2020-1041136,2020-06-17,000001,Vente,200000,7,,AV DE FAUCIGNY,0170,74380,74040,Bonne,74,,,740400000B0789,,,,,,,,,,,,,0,1,Maison,120,4,S,sols,,,58,6.321653,46.16697
2020-1041350,2020-06-04,000001,Vente,124000,233,,AV DU LEMAN,0225,74380,74040,Bonne,74,,,740400000B4046,,,76,,,,,,,,,,1,2,Appartement,36,1,,,,,,6.31892,46.168195
2020-1041567,2020-06-04,000001,Vente,219000,92,,CHE DE MATATI,0255,74380,74040,Bonne,74,,,740400000B1011,,,128,,149,48.34,,,,,,,2,3,Dépendance,,0,,,,,,6.313898,46.172749
2020-1041567,2020-06-04,000001,Vente,219000,92,,CHE DE MATATI,0255,74380,74040,Bonne,74,,,740400000B1011,,,128,,149,48.34,,,,,,,2,2,Appartement,48,2,,,,,,6.313898,46.172749
2020-1041567,2020-06-04,000001,Vente,219000,92,,CHE DE MATATI,0255,74380,74040,Bonne,74,,,740400000B1011,,,114,,,,,,,,,,1,3,Dépendance,,0,,,,,,6.313898,46.172749
2020-1041567,2020-06-04,000001,Vente,219000,92,,CHE DE MATATI,0255,74380,74040,Bonne,74,,,740400000B1011,,,3,,,,,,,,,,1,3,Dépendance,,0,,,,,,6.313898,46.172749
2020-1042029,2020-06-30,000001,Vente,400000,91,,AV DU LEMAN,0225,74380,74040,Bonne,74,,,740400000B0819,,,10,,11,,12,,207,,208,,10,4,Local industriel. commercial ou assimilé,105,0,,,,,,6.320463,46.167508
2020-1042274,2020-06-29,000001,Vente,436950,544,,VI DE CHENAZ,0075,74380,74040,Bonne,74,,,740400000B3502,,,,,,,,,,,,,0,1,Maison,125,6,S,sols,,,850,6.326385,46.171008
2020-1042319,2020-07-10,000001,Vente,296956,278,,AV DU LEMAN,0225,74380,74040,Bonne,74,,,740400000B0644,,,72,,,,,,,,,,1,3,Dépendance,,0,,,,,,6.318624,46.169257
2020-1042319,2020-07-10,000001,Vente,296956,278,,AV DU LEMAN,0225,74380,74040,Bonne,74,,,740400000B0644,,,10,65.12,,,,,,,,,1,2,Appartement,65,3,,,,,,6.318624,46.169257
2020-1042319,2020-07-10,000001,Vente,296956,278,,AV DU LEMAN,0225,74380,74040,Bonne,74,,,740400000B0644,,,71,,,,,,,,,,1,3,Dépendance,,0,,,,,,6.318624,46.169257
2020-1042319,2020-07-10,000001,Vente,296956,278,,AV DU LEMAN,0225,74380,74040,Bonne,74,,,740400000B0644,,,73,,,,,,,,,,1,3,Dépendance,,0,,,,,,6.318624,46.169257
2020-1042330,2020-06-30,000001,Vente,225000,94,,CHE DE MATATI,0255,74380,74040,Bonne,74,,,740400000B1011,,,83,,99,60,,,,,,,2,3,Dépendance,,0,,,,,,6.313898,46.172749
2020-1042330,2020-06-30,000001,Vente,225000,94,,CHE DE MATATI,0255,74380,74040,Bonne,74,,,740400000B1011,,,64,,,,,,,,,,1,3,Dépendance,,0,,,,,,6.313898,46.172749
2020-1042330,2020-06-30,000001,Vente,225000,92,,CHE DE MATATI,0255,74380,74040,Bonne,74,,,740400000B1011,,,36,,,,,,,,,,1,3,Dépendance,,0,,,,,,6.313898,46.172749
2020-1042330,2020-06-30,000001,Vente,225000,94,,CHE DE MATATI,0255,74380,74040,Bonne,74,,,740400000B1011,,,83,,99,60,,,,,,,2,2,Appartement,60,3,,,,,,6.313898,46.172749
2020-1042962,2020-07-10,000001,Vente,500000,,,PARADIS,B094,74380,74040,Bonne,74,,,740400000B2083,,,,,,,,,,,,,0,,,,,P,prés,,,315,6.32578,46.16904
2020-1042962,2020-07-10,000001,Vente,500000,435,,RTE DES ALLUAZ,0001,74380,74040,Bonne,74,,,740400000B4418,,,,,,,,,,,,,0,1,Maison,85,4,S,sols,,,875,6.325807,46.168789
2020-1043282,2020-07-31,000002,Vente,450000,,,LES PLAINES,B097,74380,74040,Bonne,74,,,740400000B3730,,,,,,,,,,,,,0,,,,,S,sols,,,28,6.320011,46.173941
2020-1043282,2020-07-31,000002,Vente,450000,1236,,RTE DE LA CHARNIAZ,0060,74380,74040,Bonne,74,,,740400000B4624,,,,,,,,,,,,,0,1,Maison,106,5,S,sols,,,1027,6.319846,46.173903
2020-1043751,2020-09-04,000001,Vente,170000,92,,CHE DE MATATI,0255,74380,74040,Bonne,74,,,740400000B1011,,,130,,139,,,,,,,,2,2,Appartement,42,2,,,,,,6.313898,46.172749
2020-1043751,2020-09-04,000001,Vente,170000,92,,CHE DE MATATI,0255,74380,74040,Bonne,74,,,740400000B1011,,,115,,,,,,,,,,1,3,Dépendance,,0,,,,,,6.313898,46.172749
2020-1043751,2020-09-04,000001,Vente,170000,92,,CHE DE MATATI,0255,74380,74040,Bonne,74,,,740400000B1011,,,10,,,,,,,,,,1,3,Dépendance,,0,,,,,,6.313898,46.172749
2020-1043751,2020-09-04,000001,Vente,170000,92,,CHE DE MATATI,0255,74380,74040,Bonne,74,,,740400000B1011,,,130,,139,,,,,,,,2,3,Dépendance,,0,,,,,,6.313898,46.172749
2020-1043844,2020-08-20,000001,Vente,415000,7,,ALL DES TROENES,0350,74380,74040,Bonne,74,,,740400000B1927,,,,,,,,,,,,,0,1,Maison,86,2,S,sols,,,1040,6.31781,46.172531
2020-1043844,2020-08-20,000001,Vente,415000,,,CHAMAGNOU,B018,74380,74040,Bonne,74,,,740400000B1956,,,,,,,,,,,,,0,,,,,S,sols,,,715,6.318082,46.172901
2020-1043844,2020-08-20,000001,Vente,415000,,,CHAMAGNOU,B018,74380,74040,Bonne,74,,,740400000B1967,,,,,,,,,,,,,0,,,,,S,sols,,,919,6.318628,46.173332
2020-1043849,2020-08-10,000001,Vente,325000,761,,AV FER A CHEVAL,0175,74380,74040,Bonne,74,,,740400000B0561,,,8,,,,,,,,,,1,3,Dépendance,,0,,,,,,6.331265,46.167347
2020-1043849,2020-08-10,000001,Vente,325000,761,,AV FER A CHEVAL,0175,74380,74040,Bonne,74,,,740400000B0561,,,2,,,,,,,,,,1,3,Dépendance,,0,,,,,,6.331265,46.167347
2020-1043849,2020-08-10,000001,Vente,325000,761,,AV FER A CHEVAL,0175,74380,74040,Bonne,74,,,740400000B0561,,,4,,6,,,,,,,,2,3,Dépendance,,0,,,,,,6.331265,46.167347
2020-1043849,2020-08-10,000001,Vente,325000,761,,AV FER A CHEVAL,0175,74380,74040,Bonne,74,,,740400000B0561,,,4,,6,,,,,,,,2,2,Appartement,106,4,,,,,,6.331265,46.167347
2020-1044261,2020-08-26,000001,Vente,1,575,,RTE DES ALLUAZ,0001,74380,74040,Bonne,74,,,740400000B3897,,,,,,,,,,,,,0,,,,,S,sols,,,433,6.32775,46.16858
2020-1044261,2020-08-26,000001,Vente,1,,,L ETANG,B061,74380,74040,Bonne,74,,,740400000B3899,,,,,,,,,,,,,0,,,,,P,prés,,,234,6.328547,46.168571
2020-1044333,2020-09-17,000001,Vente,196850,233,,AV DU LEMAN,0225,74380,74040,Bonne,74,,,740400000B4046,,,318,,,,,,,,,,1,3,Dépendance,,0,,,,,,6.31892,46.168195
2020-1044333,2020-09-17,000001,Vente,196850,233,,AV DU LEMAN,0225,74380,74040,Bonne,74,,,740400000B4046,,,80,,,,,,,,,,1,3,Dépendance,,0,,,,,,6.31892,46.168195
2020-1044333,2020-09-17,000001,Vente,196850,233,,AV DU LEMAN,0225,74380,74040,Bonne,74,,,740400000B4046,,,75,48.24,,,,,,,,,1,2,Appartement,49,2,,,,,,6.31892,46.168195
2020-1044360,2020-09-14,000001,Vente,231190,92,,CHE DE MATATI,0255,74380,74040,Bonne,74,,,740400000B1011,,,6,,,,,,,,,,1,3,Dépendance,,0,,,,,,6.313898,46.172749
2020-1044360,2020-09-14,000001,Vente,231190,92,,CHE DE MATATI,0255,74380,74040,Bonne,74,,,740400000B1011,,,19,,,,,,,,,,1,3,Dépendance,,0,,,,,,6.313898,46.172749
2020-1044360,2020-09-14,000001,Vente,231190,92,,CHE DE MATATI,0255,74380,74040,Bonne,74,,,740400000B1011,,,127,,150,,,,,,,,2,2,Appartement,60,3,,,,,,6.313898,46.172749
2020-1044360,2020-09-14,000001,Vente,231190,92,,CHE DE MATATI,0255,74380,74040,Bonne,74,,,740400000B1011,,,5,,,,,,,,,,1,3,Dépendance,,0,,,,,,6.313898,46.172749
2020-1044430,2020-09-16,000001,Vente,50000,278,,AV DU LEMAN,0225,74380,74040,Bonne,74,,,740400000B0644,,,86,,,,,,,,,,1,3,Dépendance,,0,,,,,,6.318624,46.169257
2020-1044430,2020-09-16,000001,Vente,50000,278,,AV DU LEMAN,0225,74380,74040,Bonne,74,,,740400000B0644,,,85,,,,,,,,,,1,3,Dépendance,,0,,,,,,6.318624,46.169257
2020-1044430,2020-09-16,000001,Vente,50000,278,,AV DU LEMAN,0225,74380,74040,Bonne,74,,,740400000B0644,,,83,,,,,,,,,,1,3,Dépendance,,0,,,,,,6.318624,46.169257
2020-1044449,2020-09-10,000002,Vente,690000,,,CHEZ LE MEURE,B036,74380,74040,Bonne,74,,,740400000B4244,,,,,,,,,,,,,0,,,,,PP,prés plantes,,,67,6.329831,46.175052
2020-1044449,2020-09-10,000002,Vente,690000,755,,RTE DE LIMARGUE,0230,74380,74040,Bonne,74,,,740400000B4630,,,,,,,,,,,,,0,,,,,S,sols,,,1630,6.329866,46.174794
2020-1044449,2020-09-10,000002,Vente,690000,755,,RTE DE LIMARGUE,0230,74380,74040,Bonne,74,,,740400000B4632,,,,,,,,,,,,,0,,,,,S,sols,,,403,6.329991,46.174839
2020-1044765,2020-09-29,000001,Vente,250000,278,,AV DU LEMAN,0225,74380,74040,Bonne,74,,,740400000B0644,,,2,69.55,,,,,,,,,1,2,Appartement,69,3,,,,,,6.318624,46.169257
2020-1044765,2020-09-29,000001,Vente,250000,278,,AV DU LEMAN,0225,74380,74040,Bonne,74,,,740400000B0644,,,79,,,,,,,,,,1,3,Dépendance,,0,,,,,,6.318624,46.169257
2020-1045131,2020-09-18,000001,Vente,246000,176,,RUE DU BIEF,0020,74380,74040,Bonne,74,,,740400000B3657,,,4,,6,,,,,,,,2,2,Appartement,69,3,,,,,,6.323677,46.166065
2020-1045131,2020-09-18,000001,Vente,246000,176,,RUE DU BIEF,0020,74380,74040,Bonne,74,,,740400000B3657,,,4,,6,,,,,,,,2,3,Dépendance,,0,,,,,,6.323677,46.166065
2020-1045131,2020-09-18,000001,Vente,246000,176,,RUE DU BIEF,0020,74380,74040,Bonne,74,,,740400000B3657,,,11,,,,,,,,,,1,3,Dépendance,,0,,,,,,6.323677,46.166065
2020-1045131,2020-09-18,000001,Vente,246000,176,,RUE DU BIEF,0020,74380,74040,Bonne,74,,,740400000B3657,,,10,,,,,,,,,,1,3,Dépendance,,0,,,,,,6.323677,46.166065
2020-1045237,2020-09-28,000001,Vente,696500,,,RANZILLE,B109,74380,74040,Bonne,74,,,740400000B3855,,,,,,,,,,,,,0,,,,,P,prés,,,15,6.327579,46.173675
2020-1045237,2020-09-28,000001,Vente,696500,,,RANZILLE,B109,74380,74040,Bonne,74,,,740400000B3857,,,,,,,,,,,,,0,,,,,P,prés,,,37,6.327702,46.173633
2020-1045237,2020-09-28,000001,Vente,696500,76,,IMP DE LA CLOSERAIE,0096,74380,74040,Bonne,74,,,740400000B3871,,,,,,,,,,,,,0,1,Maison,159,5,S,sols,,,861,6.32779,46.173795
2020-1045237,2020-09-28,000001,Vente,696500,76,,IMP DE LA CLOSERAIE,0096,74380,74040,Bonne,74,,,740400000B3871,,,,,,,,,,,,,0,3,Dépendance,,0,S,sols,,,861,6.32779,46.173795
2020-1045309,2020-10-15,000001,Vente,495000,245,,CHE DU COULE,0115,74380,74040,Bonne,74,,,740400000A0639,,,,,,,,,,,,,0,1,Maison,119,4,S,sols,,,583,6.340204,46.169987
2020-1045709,2020-09-28,000001,Vente,180000,89,,AV DU LEMAN,0225,74380,74040,Bonne,74,,,740400000B0819,,,5,,,,,,,,,,1,3,Dépendance,,0,,,,,,6.320463,46.167508
2020-1045709,2020-09-28,000001,Vente,180000,89,,AV DU LEMAN,0225,74380,74040,Bonne,74,,,740400000B0819,,,17,,55,63,,,,,,,2,2,Appartement,63,3,,,,,,6.320463,46.167508
2020-1046036,2020-10-08,000001,Vente,175856.88,481,,RTE DE LA CHARNIAZ,0060,74380,74040,Bonne,74,,,740400000B0141,,,114,,,,,,,,,,1,3,Dépendance,,0,,,,,,6.327749,46.170377
2020-1046036,2020-10-08,000001,Vente,175856.88,489,,RTE DE LA CHARNIAZ,0060,74380,74040,Bonne,74,,,740400000B0141,,,102,,,,,,,,,,1,2,Appartement,43,2,,,,,,6.327749,46.170377
2020-1046036,2020-10-08,000001,Vente,175856.88,489,,RTE DE LA CHARNIAZ,0060,74380,74040,Bonne,74,,,740400000B0141,,,47,,,,,,,,,,1,3,Dépendance,,0,,,,,,6.327749,46.170377
2020-1046150,2020-10-09,000001,Vente,710000,,,GRESY,B078,74380,74040,Bonne,74,,,740400000B3529,,,,,,,,,,,,,0,,,,,PP,prés plantes,,,81,6.326844,46.166746
2020-1046150,2020-10-09,000001,Vente,710000,,,GRESY,B078,74380,74040,Bonne,74,,,740400000B3958,,,,,,,,,,,,,0,,,,,PP,prés plantes,,,9,6.326742,46.166693
2020-1046173,2020-11-05,000002,Vente,375000,210,,CHE DES PRES POTEX,0305,74380,74040,Bonne,74,,,740400000B4640,,,,,,,,,,,,,0,3,Dépendance,,0,S,sols,,,1075,6.338858,46.166275
2020-1046173,2020-11-05,000002,Vente,375000,210,,CHE DES PRES POTEX,0305,74380,74040,Bonne,74,,,740400000B4640,,,,,,,,,,,,,0,1,Maison,101,5,S,sols,,,1075,6.338858,46.166275
2020-1046283,2020-10-21,000001,Vente,388100,755,,RTE DE LIMARGUE,0230,74380,74040,Bonne,74,,,740400000B4631,,,,,,,,,,,,,0,1,Maison,75,1,S,sols,,,241,6.329971,46.174803
2020-1046283,2020-10-21,000001,Vente,388100,755,,RTE DE LIMARGUE,0230,74380,74040,Bonne,74,,,740400000B4631,,,,,,,,,,,,,0,3,Dépendance,,0,S,sols,,,241,6.329971,46.174803
2020-1046360,2020-10-29,000001,Vente,181300,92,,CHE DE MATATI,0255,74380,74040,Bonne,74,,,740400000B1011,,,108,,,,,,,,,,1,3,Dépendance,,0,,,,,,6.313898,46.172749
2020-1046360,2020-10-29,000001,Vente,181300,92,,CHE DE MATATI,0255,74380,74040,Bonne,74,,,740400000B1011,,,121,,142,45.41,,,,,,,2,2,Appartement,45,2,,,,,,6.313898,46.172749
2020-1046360,2020-10-29,000001,Vente,181300,92,,CHE DE MATATI,0255,74380,74040,Bonne,74,,,740400000B1011,,,11,,,,,,,,,,1,3,Dépendance,,0,,,,,,6.313898,46.172749
2020-1046481,2020-10-27,000001,Vente,580000,76,,ALL DU DOMAINE DES VOIRONS,0151,74380,74040,Bonne,74,,,740400000B3689,,,,,,,,,,,,,0,3,Dépendance,,0,S,sols,,,831,6.324419,46.172098
2020-1046481,2020-10-27,000001,Vente,580000,76,,ALL DU DOMAINE DES VOIRONS,0151,74380,74040,Bonne,74,,,740400000B3689,,,,,,,,,,,,,0,1,Maison,108,5,S,sols,,,831,6.324419,46.172098
2020-1046750,2020-11-20,000001,Vente,491500,360,,ALL DU DOMAINE DES VOIRONS,0151,74380,74040,Bonne,74,,,740400000B3703,,,,,,,,,,,,,0,3,Dépendance,,0,S,sols,,,980,6.322324,46.170844
2020-1046750,2020-11-20,000001,Vente,491500,360,,ALL DU DOMAINE DES VOIRONS,0151,74380,74040,Bonne,74,,,740400000B3703,,,,,,,,,,,,,0,1,Maison,125,5,S,sols,,,980,6.322324,46.170844
2020-1046774,2020-11-23,000001,Vente,130000,245,,ALL DU DOMAINE DES VOIRONS,0151,74380,74040,Bonne,74,,,740400000B3698,,,1,,,,,,,,,,1,2,Appartement,50,2,,,,,,6.32303,46.171459
2020-1046774,2020-11-23,000001,Vente,130000,245,,ALL DU DOMAINE DES VOIRONS,0151,74380,74040,Bonne,74,,,740400000B3698,,,19,,,,,,,,,,1,3,Dépendance,,0,,,,,,6.32303,46.171459
2020-1047017,2020-11-20,000001,Vente,15000,278,,AV DU LEMAN,0225,74380,74040,Bonne,74,,,740400000B0644,,,87,,,,,,,,,,1,3,Dépendance,,0,,,,,,6.318624,46.169257
2020-1047393,2020-11-20,000001,Vente,222100,92,,CHE DE MATATI,0255,74380,74040,Bonne,74,,,740400000B1011,,,104,,,,,,,,,,1,3,Dépendance,,0,,,,,,6.313898,46.172749
2020-1047393,2020-11-20,000001,Vente,222100,92,,CHE DE MATATI,0255,74380,74040,Bonne,74,,,740400000B1011,,,132,,143,,,,,,,,2,3,Dépendance,,0,,,,,,6.313898,46.172749
2020-1047393,2020-11-20,000001,Vente,222100,92,,CHE DE MATATI,0255,74380,74040,Bonne,74,,,740400000B1011,,,12,,,,,,,,,,1,3,Dépendance,,0,,,,,,6.313898,46.172749
2020-1047393,2020-11-20,000001,Vente,222100,92,,CHE DE MATATI,0255,74380,74040,Bonne,74,,,740400000B1011,,,132,,143,,,,,,,,2,2,Appartement,63,3,,,,,,6.313898,46.172749
2020-1047470,2020-12-10,000001,Vente,340970,233,,AV DU LEMAN,0225,74380,74040,Bonne,74,,,740400000B4046,,,23,,60,,,,,,,,2,2,Appartement,110,4,,,,,,6.31892,46.168195
2020-1047470,2020-12-10,000001,Vente,340970,233,,AV DU LEMAN,0225,74380,74040,Bonne,74,,,740400000B4046,,,33,,,,,,,,,,1,3,Dépendance,,0,,,,,,6.31892,46.168195
2020-1047470,2020-12-10,000001,Vente,340970,233,,AV DU LEMAN,0225,74380,74040,Bonne,74,,,740400000B4046,,,23,,60,,,,,,,,2,3,Dépendance,,0,,,,,,6.31892,46.168195
2020-1048148,2020-12-22,000001,Vente,200000,85,,CHE DU CROZAT,0145,74380,74040,Bonne,74,,,740400000B1272,,,2,,,,,,,,,,1,3,Dépendance,,0,,,,,,6.332951,46.168283
2020-1048148,2020-12-22,000001,Vente,200000,85,,CHE DU CROZAT,0145,74380,74040,Bonne,74,,,740400000B1272,,,1,60.29,,,,,,,,,1,2,Appartement,60,3,,,,,,6.332951,46.168283
2020-1048148,2020-12-22,000001,Vente,200000,85,,CHE DU CROZAT,0145,74380,74040,Bonne,74,,,740400000B1272,,,2,,,,,,,,,,1,3,Dépendance,,0,,,,,,6.332951,46.168283
2020-1048148,2020-12-22,000001,Vente,200000,85,,CHE DU CROZAT,0145,74380,74040,Bonne,74,,,740400000B1272,,,1,60.29,,,,,,,,,1,3,Dépendance,,0,,,,,,6.332951,46.168283
2020-1048798,2020-12-30,000001,Vente,325000,278,,AV DU LEMAN,0225,74380,74040,Bonne,74,,,740400000B0644,,,97,,,,,,,,,,1,3,Dépendance,,0,,,,,,6.318624,46.169257
2020-1048798,2020-12-30,000001,Vente,325000,278,,AV DU LEMAN,0225,74380,74040,Bonne,74,,,740400000B0644,,,4,,,,,,,,,,1,2,Appartement,84,4,,,,,,6.318624,46.169257
2020-1048798,2020-12-30,000001,Vente,325000,278,,AV DU LEMAN,0225,74380,74040,Bonne,74,,,740400000B0644,,,110,,,,,,,,,,1,3,Dépendance,,0,,,,,,6.318624,46.169257
2020-1048967,2020-12-29,000001,Vente,333000,153,,CHE D'ORLYE,0280,74380,74040,Bonne,74,,,740400000B1674,,,,,,,,,,,,,0,1,Maison,88,5,T,terres,,,1496,6.32979,46.172274
2020-1048967,2020-12-29,000001,Vente,333000,153,,CHE D'ORLYE,0280,74380,74040,Bonne,74,,,740400000B1674,,,,,,,,,,,,,0,1,Maison,88,5,S,sols,,,589,6.32979,46.172274
2020-1048967,2020-12-29,000001,Vente,333000,,,ORLYE,B092,74380,74040,Bonne,74,,,740400000B1675,,,,,,,,,,,,,0,,,,,T,terres,,,207,6.32957,46.171995
2020-1049032,2020-12-29,000001,Vente,499000,330,,CHE DES CHAPITOLES,0050,74380,74040,Bonne,74,,,740400000B3998,,,,,,,,,,,,,0,1,Maison,113,4,S,sols,,,1069,6.318215,46.176967
2020-1049187,2020-09-18,000001,Adjudication,266000,1647,,AV FER A CHEVAL,0175,74380,74040,Bonne,74,,,740400000B1387,,,,,,,,,,,,,0,1,Maison,91,4,S,sols,,,277,6.342584,46.166084
2020-1049187,2020-09-18,000001,Adjudication,266000,,,SOUS MALAN,B120,74380,74040,Bonne,74,,,740400000B1390,,,,,,,,,,,,,0,,,,,T,terres,,,177,6.342437,46.166142
