id_mutation,date_mutation,numero_disposition,nature_mutation,valeur_fonciere,adresse_numero,adresse_suffixe,adresse_nom_voie,adresse_code_voie,code_postal,code_commune,nom_commune,code_departement,ancien_code_commune,ancien_nom_commune,id_parcelle,ancien_id_parcelle,numero_volume,lot1_numero,lot1_surface_carrez,lot2_numero,lot2_surface_carrez,lot3_numero,lot3_surface_carrez,lot4_numero,lot4_surface_carrez,lot5_numero,lot5_surface_carrez,nombre_lots,code_type_local,type_local,surface_reelle_bati,nombre_pieces_principales,code_nature_culture,nature_culture,code_nature_culture_speciale,nature_culture_speciale,surface_terrain,longitude,latitude
2020-1056645,2020-01-24,000001,Vente,102430,174,,RTE DU BREVON,0027,74470,74287,Vailly,74,,,742870000C0652,,,4,57.98,,,,,,,,,1,2,Appartement,59,3,,,,,,6.542777,46.303795
2020-1056748,2020-02-07,000001,Vente,135000,,,LE NEIZET,B241,74470,74287,Vailly,74,,,742870000A1772,,,,,,,,,,,,,0,,,,,P,prés,,,278,6.533306,46.309704
2020-1056748,2020-02-07,000001,Vente,135000,,,LE NEIZET,B241,74470,74287,Vailly,74,,,742870000A1775,,,,,,,,,,,,,0,,,,,P,prés,,,145,6.53363,46.30986
2020-1056748,2020-02-07,000001,Vente,135000,,,LE NEIZET,B241,74470,74287,Vailly,74,,,742870000A1776,,,,,,,,,,,,,0,,,,,P,prés,,,2432,6.533944,46.309847
2020-1056748,2020-02-07,000001,Vente,135000,618,,CHE DE PLANSUET,0197,74470,74287,Vailly,74,,,742870000A2038,,,,,,,,,,,,,0,1,Maison,40,1,S,sols,,,219,6.533796,46.309703
2020-1056748,2020-02-07,000001,Vente,135000,,,GRANGES AU RIOUD,B177,74470,74287,Vailly,74,,,742870000A2040,,2,,,,,,,,,,,0,,,,,,,,,,6.533755,46.309694
2020-1056755,2020-02-07,000001,Vente,50,,,GRANGES AU RIOUD,B177,74470,74287,Vailly,74,,,742870000A2039,,,,,,,,,,,,,0,,,,,S,sols,,,61,6.533783,46.309598
2020-1057270,2020-03-10,000001,Vente,402611,,,LA COTE D EN HAUT,B095,74470,74287,Vailly,74,,,742870000A0725,,,,,,,,,,,,,0,,,,,P,prés,,,29,6.534851,46.307319
2020-1057270,2020-03-10,000001,Vente,402611,,,LA COTE D EN HAUT,B095,74470,74287,Vailly,74,,,742870000A0726,,,,,,,,,,,,,0,,,,,P,prés,,,62,6.534884,46.307297
2020-1057270,2020-03-10,000001,Vente,402611,1473,,RTE DE LA COTE,0080,74470,74287,Vailly,74,,,742870000A0727,,,,,,,,,,,,,0,1,Maison,267,6,S,sols,,,692,6.53457,46.30718
2020-1057270,2020-03-10,000001,Vente,402611,,,LA COTE D EN HAUT,B095,74470,74287,Vailly,74,,,742870000A0729,,,,,,,,,,,,,0,,,,,P,prés,,,114,6.534826,46.307126
2020-1057270,2020-03-10,000001,Vente,402611,,,LA COTE D EN HAUT,B095,74470,74287,Vailly,74,,,742870000A0731,,,,,,,,,,,,,0,,,,,J,jardins,,,378,,
2020-1057270,2020-03-10,000001,Vente,402611,,,LA COTE D EN HAUT,B095,74470,74287,Vailly,74,,,742870000A0732,,,,,,,,,,,,,0,,,,,J,jardins,,,13,6.53447,46.30697
2020-1057270,2020-03-10,000001,Vente,402611,,,LA COTE D EN HAUT,B095,74470,74287,Vailly,74,,,742870000A1656,,,,,,,,,,,,,0,,,,,S,sols,,,4,6.534952,46.307344
2020-1057305,2020-03-13,000002,Echange,8200,,,LA ROUTE,B330,74470,74287,Vailly,74,,,742870000A2034,,,,,,,,,,,,,0,,,,,T,terres,,,327,6.532646,46.305899
2020-1057305,2020-03-13,000003,Echange,8200,,,LES ANTES,B005,74470,74287,Vailly,74,,,742870000A2037,,,,,,,,,,,,,0,,,,,AB,terrains a bâtir,,,169,6.53267,46.305642
2020-1057499,2020-04-07,000001,Vente,320000,202,,RTE DES BARLATYS,0009,74470,74287,Vailly,74,,,742870000E1080,,,,,,,,,,,,,0,1,Maison,90,4,S,sols,,,1044,6.551879,46.286202
2020-1057499,2020-04-07,000001,Vente,320000,,,LES CHARGES D EN BAS,B057,74470,74287,Vailly,74,,,742870000E1082,,,,,,,,,,,,,0,,,,,T,terres,,,152,6.551232,46.286187
2020-1057500,2020-03-26,000001,Vente,401800,5494,,LES ANTES,B005,74470,74287,Vailly,74,,,742870000A1998,,,,,,,,,,,,,0,1,Maison,90,2,S,sols,,,513,6.532555,46.305475
2020-1057500,2020-03-26,000001,Vente,401800,,,LA ROUTE,B330,74470,74287,Vailly,74,,,742870000A2035,,,,,,,,,,,,,0,,,,,T,terres,,,346,6.532449,46.305583
2020-1057500,2020-03-26,000001,Vente,401800,,,LES ANTES,B005,74470,74287,Vailly,74,,,742870000A2037,,,,,,,,,,,,,0,,,,,AB,terrains a bâtir,,,169,6.53267,46.305642
2020-1058055,2020-03-13,000001,Vente,367000,,,L HAUTE COTE,B193,74470,74287,Vailly,74,,,742870000A0403,,,,,,,,,,,,,0,,,,,J,jardins,,,202,6.535455,46.308876
2020-1058055,2020-03-13,000001,Vente,367000,,,L HAUTE COTE,B193,74470,74287,Vailly,74,,,742870000A0407,,,,,,,,,,,,,0,,,,,J,jardins,,,277,6.535889,46.309015
2020-1058055,2020-03-13,000001,Vente,367000,1742,,RTE DE LA COTE,0080,74470,74287,Vailly,74,,,742870000A0408,,,,,,,,,,,,,0,1,Maison,147,4,S,sols,,,305,6.536267,46.309263
2020-1058055,2020-03-13,000001,Vente,367000,,,L HAUTE COTE,B193,74470,74287,Vailly,74,,,742870000A1917,,,,,,,,,,,,,0,,,,,T,terres,,,484,6.536171,46.309156
2020-1058055,2020-03-13,000001,Vente,367000,,,L HAUTE COTE,B193,74470,74287,Vailly,74,,,742870000A1920,,,,,,,,,,,,,0,,,,,T,terres,,,64,6.536303,46.309349
2020-1058458,2020-07-03,000001,Vente,344100,,,EN BAS DES GRENIERS,B011,74470,74287,Vailly,74,,,742870000A1989,,,,,,,,,,,,,0,,,,,S,sols,,,55,6.533468,46.30649
2020-1058458,2020-07-03,000001,Vente,344100,1369,,RTE DE LA COTE,0080,74470,74287,Vailly,74,,,742870000A1990,,,,,,,,,,,,,0,1,Maison,150,4,S,sols,,,345,6.533381,46.306444
2020-1058654,2020-07-23,000001,Vente,,,,SOUS LA RAVINE,B354,74470,74287,Vailly,74,,,742870000A1360,,,,,,,,,,,,,0,,,,,S,sols,,,227,6.533728,46.304988
2020-1059224,2020-08-05,000001,Vente,17350,,,LE POUAN,B291,74470,74287,Vailly,74,,,742870000A1766,,,,,,,,,,,,,0,,,,,T,terres,,,347,6.533088,46.307082
2020-1059225,2020-08-05,000002,Vente,19500,,,EN BAS DES GRENIERS,B011,74470,74287,Vailly,74,,,742870000A1041,,,,,,,,,,,,,0,,,,,T,terres,,,390,6.533076,46.306951
2020-1059859,2020-10-07,000001,Vente,2500,,,SOUS CHEZ DAGNIN,B346,74470,74287,Vailly,74,,,742870000C0300,,,,,,,,,,,,,0,,,,,T,terres,,,3852,6.547497,46.303453
2020-1059859,2020-10-07,000001,Vente,2500,,,SOUS CHEZ DAGNIN,B346,74470,74287,Vailly,74,,,742870000C0301,,,,,,,,,,,,,0,,,,,T,terres,,,4297,6.547159,46.303691
2020-1060074,2020-10-20,000001,Vente,3967.74,,,SOUS LE FREU,B362,74470,74287,Vailly,74,,,742870000D1682,,,,,,,,,,,,,0,,,,,BM,futaies mixtes,,,150,6.559829,46.293621
2020-1060074,2020-10-20,000001,Vente,3967.74,,,SOUS LE FREU,B362,74470,74287,Vailly,74,,,742870000D1683,,,,,,,,,,,,,0,,,,,BM,futaies mixtes,,,1715,6.559816,46.293379
2020-1060074,2020-10-20,000001,Vente,3967.74,,,SOUS LE FREU,B362,74470,74287,Vailly,74,,,742870000D1685,,,,,,,,,,,,,0,,,,,BF,futaies feuillues,,,430,6.560407,46.293241
2020-1060074,2020-10-20,000001,Vente,3967.74,,,LA BIOLLAZ,B014,74470,74287,Vailly,74,,,742870000D1737,,,,,,,,,,,,,0,,,,,PA,pâtures,,,3600,6.558323,46.293459
2020-1060074,2020-10-20,000001,Vente,3967.74,,,LA BIOLLAZ,B014,74470,74287,Vailly,74,,,742870000D1740,,,,,,,,,,,,,0,,,,,BM,futaies mixtes,,,798,6.55953,46.293359
2020-1060074,2020-10-20,000001,Vente,3967.74,,,LA BIOLLAZ,B014,74470,74287,Vailly,74,,,742870000D1741,,,,,,,,,,,,,0,,,,,BF,futaies feuillues,,,2110,6.559565,46.293868
2020-1060074,2020-10-20,000001,Vente,3967.74,,,LA BIOLLAZ,B014,74470,74287,Vailly,74,,,742870000D1742,,,,,,,,,,,,,0,,,,,PA,pâtures,,,6812,6.558814,46.293869
2020-1060074,2020-10-20,000001,Vente,3967.74,,,LA BIOLLAZ,B014,74470,74287,Vailly,74,,,742870000D1744,,,,,,,,,,,,,0,,,,,S,sols,,,180,6.558335,46.293852
2020-1060074,2020-10-20,000001,Vente,3967.74,,,LA CHAPPAZ,B054,74470,74287,Vailly,74,,,742870000D1747,,,,,,,,,,,,,0,,,,,PA,pâtures,,,6248,6.55738,46.293641
2020-1060344,2020-10-23,000002,Vente,36000,,,LES CHARGES D EN BAS,B057,74470,74287,Vailly,74,,,742870000E1127,,,,,,,,,,,,,0,,,,,P,prés,,,206,6.552003,46.285382
2020-1060344,2020-10-23,000002,Vente,36000,,,LES CHARGES D EN BAS,B057,74470,74287,Vailly,74,,,742870000E1129,,,,,,,,,,,,,0,,,,,T,terres,,,513,6.55192,46.285424
2020-1060523,2020-11-03,000001,Vente,258540,2016,,RTE DE LAYAT,0160,74470,74287,Vailly,74,,,742870000F0768,,,,,,,,,,,,,0,1,Maison,64,3,S,sols,,,1000,6.54468,46.288264
2020-1060523,2020-11-03,000001,Vente,258540,2016,,RTE DE LAYAT,0160,74470,74287,Vailly,74,,,742870000F0768,,,,,,,,,,,,,0,1,Maison,64,3,L,landes,,,648,6.54468,46.288264
2020-1060523,2020-11-03,000001,Vente,258540,,,LE GUE,B191,74470,74287,Vailly,74,,,742870000F0769,,,,,,,,,,,,,0,,,,,S,sols,,,35,6.544682,46.288227
2020-1061054,2020-12-11,000001,Vente,220880,80,,ALL DU JALLAN,0155,74470,74287,Vailly,74,,,742870000A1986,,,44,,,,,,,,,,1,3,Dépendance,,0,,,,,,6.536153,46.301555
2020-1061054,2020-12-11,000001,Vente,220880,80,,ALL DU JALLAN,0155,74470,74287,Vailly,74,,,742870000A1986,,,49,,66,,,,,,,,2,2,Appartement,92,5,,,,,,6.536153,46.301555
2020-1061054,2020-12-11,000001,Vente,220880,80,,ALL DU JALLAN,0155,74470,74287,Vailly,74,,,742870000A1986,,,49,,66,,,,,,,,2,3,Dépendance,,0,,,,,,6.536153,46.301555
2020-1061250,2020-10-19,000001,Vente,1529.1,,,SUR LA PLAGNE,B270,74470,74287,Vailly,74,,,742870000D1460,,,,,,,,,,,,,0,,,,,BM,futaies mixtes,,,3406,6.556337,46.297272
2020-1061250,2020-10-19,000001,Vente,1529.1,,,SUR LA PLAGNE,B270,74470,74287,Vailly,74,,,742870000D1465,,,,,,,,,,,,,0,,,,,BM,futaies mixtes,,,3406,6.556839,46.297771
2020-1061250,2020-10-19,000001,Vente,1529.1,,,LES ESSERTS,B144,74470,74287,Vailly,74,,,742870000D1768,,,,,,,,,,,,,0,,,,,BF,futaies feuillues,,,3382,6.555144,46.292567
2020-1061251,2020-12-21,000001,Vente,270,,,LE CAOUAZ,B031,74470,74287,Vailly,74,,,742870000D1413,,,,,,,,,,,,,0,,,,,BM,futaies mixtes,,,1360,6.554929,46.296107
2020-1061251,2020-12-21,000001,Vente,270,,,LES BAUCHES,B012,74470,74287,Vailly,74,,,742870000D1533,,,,,,,,,,,,,0,,,,,BM,futaies mixtes,,,586,6.557947,46.298809
2020-1061253,2020-12-21,000001,Vente,1073.85,,,SUR LA PLAGNE,B270,74470,74287,Vailly,74,,,742870000D1456,,,,,,,,,,,,,0,,,,,BM,futaies mixtes,,,1030,6.55758,46.296481
2020-1061253,2020-12-21,000001,Vente,1073.85,,,LES BAUCHES,B012,74470,74287,Vailly,74,,,742870000D1518,,,,,,,,,,,,,0,,,,,BM,futaies mixtes,,,6129,6.55883,46.298195
2020-1061255,2020-12-21,000001,Vente,300,,,LE CAOUAZ,B031,74470,74287,Vailly,74,,,742870000D1403,,,,,,,,,,,,,0,,,,,BM,futaies mixtes,,,1494,6.553683,46.2964
2020-1061255,2020-12-21,000001,Vente,300,,,LE CAOUAZ,B031,74470,74287,Vailly,74,,,742870000D1414,,,,,,,,,,,,,0,,,,,BM,futaies mixtes,,,1360,6.555463,46.295565
