id_mutation,date_mutation,numero_disposition,nature_mutation,valeur_fonciere,adresse_numero,adresse_suffixe,adresse_nom_voie,adresse_code_voie,code_postal,code_commune,nom_commune,code_departement,ancien_code_commune,ancien_nom_commune,id_parcelle,ancien_id_parcelle,numero_volume,lot1_numero,lot1_surface_carrez,lot2_numero,lot2_surface_carrez,lot3_numero,lot3_surface_carrez,lot4_numero,lot4_surface_carrez,lot5_numero,lot5_surface_carrez,nombre_lots,code_type_local,type_local,surface_reelle_bati,nombre_pieces_principales,code_nature_culture,nature_culture,code_nature_culture_speciale,nature_culture_speciale,surface_terrain,longitude,latitude
2020-1061975,2020-01-24,000001,Vente,135470,61,,RUE DES JARDINS,0180,76410,76178,Cléon,76,,,76178000AO0672,,,,,,,,,,,,,0,1,Maison,72,4,S,sols,,,990,1.031248,49.315475
2020-1062070,2020-01-31,000001,Vente,183000,770,,RUE DE LA LIBERTE,0200,76410,76178,Cléon,76,,,76178000AD0431,,,,,,,,,,,,,0,1,Maison,108,4,S,sols,,,500,1.026988,49.313993
2020-1062458,2020-02-14,000001,Vente,169900,325,,RUE DES ECOLES,0140,76410,76178,Cléon,76,,,76178000AD0091,,,,,,,,,,,,,0,1,Maison,77,4,S,sols,,,620,1.026705,49.310479
2020-1062546,2020-02-25,000001,Vente,129000,617,,RUE DES ECOLES,0140,76410,76178,Cléon,76,,,76178000AD0328,,,,,,,,,,,,,0,1,Maison,94,5,S,sols,,,258,1.030071,49.311834
2020-1062566,2020-02-24,000001,Vente,112500,323,,RUE DE TOURVILLE,0440,76410,76178,Cléon,76,,,76178000AE0910,,,,,,,,,,,,,0,1,Maison,65,3,AG,terrains d'agrément,,,191,1.025823,49.30656
2020-1062566,2020-02-24,000001,Vente,112500,323,,RUE DE TOURVILLE,0440,76410,76178,Cléon,76,,,76178000AE0910,,,,,,,,,,,,,0,1,Maison,65,3,S,sols,,,1000,1.025823,49.30656
2020-1062722,2020-03-03,000001,Vente,143200,547,,RUE DE TOURVILLE,0440,76410,76178,Cléon,76,,,76178000AE0940,,,,,,,,,,,,,0,1,Maison,134,5,S,sols,,,601,1.028715,49.307259
2020-1062916,2020-03-06,000002,Vente,782731.2,,,LE PETIT CLOS,B036,76410,76178,Cléon,76,,,76178000AH0858,,,,,,,,,,,,,0,,,,,S,sols,,,382,1.039121,49.307622
2020-1062916,2020-03-06,000002,Vente,782731.2,,,LE PETIT CLOS,B036,76410,76178,Cléon,76,,,76178000AH0990,,,,,,,,,,,,,0,,,,,P,prés,,,63345,1.042224,49.308435
2020-1063015,2020-03-23,000001,Vente,159500,186,,RUE JEAN ROSTAND,0183,76410,76178,Cléon,76,,,76178000AO0640,,,,,,,,,,,,,0,1,Maison,89,4,S,sols,,,315,1.031096,49.313468
2020-1063284,2020-04-10,000001,Vente,180000,,,LE BOIS DES COUTURES,B004,76410,76178,Cléon,76,,,76178000BA0060,,,,,,,,,,,,,0,,,,,T,terres,,,7653,1.058056,49.311223
2020-1063284,2020-04-10,000001,Vente,180000,,,LE BOIS DES COUTURES,B004,76410,76178,Cléon,76,,,76178000BA0063,,,,,,,,,,,,,0,,,,,BT,taillis simples,,,1236,1.058208,49.311796
2020-1063284,2020-04-10,000001,Vente,180000,,,LE BOIS DES COUTURES,B004,76410,76178,Cléon,76,,,76178000BA0069,,,,,,,,,,,,,0,,,,,T,terres,,,1528,1.0562,49.311065
2020-1063316,2020-03-27,000001,Vente,30000,9020,,ZAC DU MOULIN,A010,76410,76178,Cléon,76,,,76178000BA0200,,,,,,,,,,,,,0,4,Local industriel. commercial ou assimilé,10,0,S,sols,,,96,1.059144,49.317794
2020-1063599,2020-05-04,000001,Vente,207200,71,,RUE DU CHEMIN FOURCHE,0118,76410,76178,Cléon,76,,,76178000AD0408,,,,,,,,,,,,,0,1,Maison,89,5,S,sols,,,680,1.026068,49.312117
2020-1064094,2020-05-19,000001,Vente,152000,5061,A,CHE DES GARDES,0173,76410,76178,Cléon,76,,,76178000AH0191,,,,,,,,,,,,,0,1,Maison,80,3,S,sols,,,609,1.039083,49.315312
2020-1064094,2020-05-19,000001,Vente,152000,,,CHE DES GARDES,0173,76410,76178,Cléon,76,,,76178000AH0716,,,,,,,,,,,,,0,,,,,S,sols,,,388,1.039202,49.315396
2020-1064164,2020-06-11,000001,Vente,272000,52,C,RUE RAYMOND SOUDAY,0346,76410,76178,Cléon,76,,,76178000AH0811,,,5,152.3,,,,,,,,,1,4,Local industriel. commercial ou assimilé,153,0,,,,,,1.039243,49.309267
2020-1064290,2020-06-05,000001,Vente,170000,89,,RUE EMILE ZOLA,0164,76410,76178,Cléon,76,,,76178000AD0225,,,,,,,,,,,,,0,1,Maison,80,4,S,sols,,,178,1.02752,49.311542
2020-1064305,2020-06-15,000001,Vente,158000,40,,RUE JEAN JAURES,0182,76410,76178,Cléon,76,,,76178000AD0240,,,,,,,,,,,,,0,1,Maison,92,4,S,sols,,,264,1.027241,49.310877
2020-1064360,2020-06-16,000001,Vente,177000,325,A,RUE DES MARTYRS,0280,76410,76178,Cléon,76,,,76178000AC0130,,,,,,,,,,,,,0,1,Maison,160,4,S,sols,,,972,1.02334,49.309662
2020-1064361,2020-06-05,000001,Vente,146000,259,,RUE CHARLES PERRAULT,0102,76410,76178,Cléon,76,,,76178000AE0856,,,,,,,,,,,,,0,1,Maison,107,7,S,sols,,,175,1.031523,49.306435
2020-1064362,2020-06-16,000001,Vente,214000,148,,RUE FREDERIC MISTRAL,0170,76410,76178,Cléon,76,,,76178000AE0958,,,,,,,,,,,,,0,1,Maison,75,4,S,sols,,,714,1.028052,49.309388
2020-1064747,2020-06-25,000001,Vente,84000,55,,RUE LOUISE MICHEL,0270,76410,76178,Cléon,76,,,76178000AO0860,,,80,,,,,,,,,,1,3,Dépendance,,0,,,,,,1.031676,49.312528
2020-1064747,2020-06-25,000001,Vente,84000,55,,RUE LOUISE MICHEL,0270,76410,76178,Cléon,76,,,76178000AO0860,,,22,51.55,,,,,,,,,1,2,Appartement,52,2,,,,,,1.031676,49.312528
2020-1064747,2020-06-25,000001,Vente,84000,55,,RUE LOUISE MICHEL,0270,76410,76178,Cléon,76,,,76178000AO0860,,,47,,,,,,,,,,1,3,Dépendance,,0,,,,,,1.031676,49.312528
2020-1064762,2020-06-19,000001,Vente,48000,15,,RUE LOUISE MICHEL,0270,76410,76178,Cléon,76,,,76178000AO0860,,,86,,,,,,,,,,1,3,Dépendance,,0,,,,,,1.031676,49.312528
2020-1064762,2020-06-19,000001,Vente,48000,15,,RUE LOUISE MICHEL,0270,76410,76178,Cléon,76,,,76178000AO0860,,,2,,,,,,,,,,1,2,Appartement,39,2,,,,,,1.031676,49.312528
2020-1064907,2020-07-13,000001,Vente,125000,23,,RUE LOUIS PASTEUR,0273,76410,76178,Cléon,76,,,76178000AH0957,,,,,,,,,,,,,0,1,Maison,81,4,S,sols,,,127,1.032723,49.312008
2020-1064975,2020-07-07,000001,Vente,65000,414,,RUE DE LA LIBERTE,0200,76410,76178,Cléon,76,,,76178000AD0650,,,,,,,,,,,,,0,1,Maison,72,6,AB,terrains a bâtir,,,950,1.022641,49.313037
2020-1064976,2020-07-10,000001,Vente,163000,269,,RUE DES OLIVIERS,0300,76410,76178,Cléon,76,,,76178000AH0674,,,,,,,,,,,,,0,1,Maison,82,4,S,sols,,,497,1.036074,49.315044
2020-1065674,2020-07-30,000001,Vente,129000,,,LOTISSEMENT DES BRULINS,B028,76410,76178,Cléon,76,,,76178000AE0197,,,,,,,,,,,,,0,,,,,S,sols,,,19,1.02549,49.308204
2020-1065674,2020-07-30,000001,Vente,129000,,,LOTISSEMENT DES BRULINS,B028,76410,76178,Cléon,76,,,76178000AE0317,,,,,,,,,,,,,0,,,,,S,sols,,,203,1.025445,49.308344
2020-1065674,2020-07-30,000001,Vente,129000,115,,RUE DEBUSSY,0129,76410,76178,Cléon,76,,,76178000AE0318,,,,,,,,,,,,,0,1,Maison,54,3,S,sols,,,317,1.025495,49.308459
2020-1065674,2020-07-30,000001,Vente,129000,115,,RUE DEBUSSY,0129,76410,76178,Cléon,76,,,76178000AE0318,,,,,,,,,,,,,0,3,Dépendance,,0,S,sols,,,317,1.025495,49.308459
2020-1065674,2020-07-30,000001,Vente,129000,,,LOTISSEMENT DES BRULINS,B028,76410,76178,Cléon,76,,,76178000AE0892,,,,,,,,,,,,,0,,,,,S,sols,,,637,1.025582,49.30881
2020-1065803,2020-09-01,000001,Vente,110250,95,,RUE EMILE AUBRY,0163,76410,76178,Cléon,76,,,76178000AO0721,,,,,,,,,,,,,0,1,Maison,84,4,S,sols,,,373,1.028794,49.312182
2020-1065875,2020-09-01,000001,Vente,95170,278,,RUE CHARLES PERRAULT,0102,76410,76178,Cléon,76,,,76178000AE0755,,,,,,,,,,,,,0,1,Maison,68,3,S,sols,,,310,1.032026,49.306286
2020-1065921,2020-09-02,000001,Vente,178250,190,,RUE DE LA PIERRE AUX PAGES,0320,76410,76178,Cléon,76,,,76178000AB0392,,,,,,,,,,,,,0,1,Maison,85,4,S,sols,,,500,1.033561,49.316865
2020-1066001,2020-09-08,000001,Vente,157000,160,,RUE DE L EGLISE,0160,76410,76178,Cléon,76,,,76178000AO0100,,,,,,,,,,,,,0,3,Dépendance,,0,S,sols,,,219,1.033551,49.313413
2020-1066001,2020-09-08,000001,Vente,157000,160,,RUE DE L EGLISE,0160,76410,76178,Cléon,76,,,76178000AO0100,,,,,,,,,,,,,0,1,Maison,100,4,S,sols,,,219,1.033551,49.313413
2020-1066038,2020-09-10,000001,Vente,195000,54,,ALL FLEMING,0167,76410,76178,Cléon,76,,,76178000AO0546,,,,,,,,,,,,,0,1,Maison,114,5,S,sols,,,226,1.029211,49.313916
2020-1066127,2020-08-28,000001,Vente,181000,9,,ALL DU BOIS ROND,0122,76410,76178,Cléon,76,,,76178000AH0476,,,,,,,,,,,,,0,1,Maison,118,6,S,sols,,,518,1.033826,49.306924
2020-1066325,2020-09-18,000001,Vente,283450,50,,ALL EMILE LITTRE,0241,76410,76178,Cléon,76,,,76178000AE0769,,,,,,,,,,,,,0,1,Maison,164,5,S,sols,,,655,1.022846,49.304902
2020-1066857,2020-09-25,000001,Vente,110000,15,,RUE LOUISE MICHEL,0270,76410,76178,Cléon,76,,,76178000AO0860,,,97,,,,,,,,,,1,3,Dépendance,,0,,,,,,1.031676,49.312528
2020-1066857,2020-09-25,000001,Vente,110000,55,,RUE LOUISE MICHEL,0270,76410,76178,Cléon,76,,,76178000AO0860,,,79,,,,,,,,,,1,3,Dépendance,,0,,,,,,1.031676,49.312528
2020-1066857,2020-09-25,000001,Vente,110000,55,,RUE LOUISE MICHEL,0270,76410,76178,Cléon,76,,,76178000AO0860,,,55,,,,,,,,,,1,3,Dépendance,,0,,,,,,1.031676,49.312528
2020-1066857,2020-09-25,000001,Vente,110000,55,,RUE LOUISE MICHEL,0270,76410,76178,Cléon,76,,,76178000AO0860,,,26,70.48,,,,,,,,,1,2,Appartement,69,3,,,,,,1.031676,49.312528
2020-1067090,2020-10-02,000001,Vente,150000,60,,RUE EMILE AUBRY,0163,76410,76178,Cléon,76,,,76178000AD0467,,,,,,,,,,,,,0,1,Maison,105,6,S,sols,,,293,1.029346,49.312083
2020-1067397,2020-11-03,000001,Vente,123000,106,,RUE LOUIS PASTEUR,0273,76410,76178,Cléon,76,,,76178000AH0937,,,,,,,,,,,,,0,1,Maison,81,4,S,sols,,,101,1.033467,49.312238
2020-1067540,2020-10-29,000001,Vente,2000000,,,LE BOIS DES COUTURES,B004,76410,76178,Cléon,76,,,76178000BA0152,,,,,,,,,,,,,0,4,Local industriel. commercial ou assimilé,3232,0,CA,carrières,,,6338,1.059632,49.314943
2020-1067639,2020-11-12,000002,Vente,42000,368,,RUE RENE SORTEMBOC,0360,76410,76178,Cléon,76,,,76178000AO0902,,,,,,,,,,,,,0,1,Maison,90,3,S,sols,,,347,1.0318,49.318126
2020-1067650,2020-11-18,000001,Vente,154000,,,LES FEUGRAIS,B019,76410,76178,Cléon,76,,,76178000AE0511,,,,,,,,,,,,,0,,,,,S,sols,,,261,1.023911,49.302714
2020-1067650,2020-11-18,000001,Vente,154000,,,LES FEUGRAIS,B019,76410,76178,Cléon,76,,,76178000AE0520,,,,,,,,,,,,,0,,,,,S,sols,,,718,1.024464,49.302892
2020-1067650,2020-11-18,000001,Vente,154000,40,,IMP DENIS DIDEROT,0132,76410,76178,Cléon,76,,,76178000AE0672,,,,,,,,,,,,,0,1,Maison,83,4,S,sols,,,859,1.023965,49.302948
2020-1067791,2020-11-03,000001,Vente,160000,,,BAS CLEON,B001,76410,76178,Cléon,76,,,76178000AN0097,,,,,,,,,,,,,0,,,,,S,sols,,,390,1.029141,49.321407
2020-1067791,2020-11-03,000001,Vente,160000,106,C,RUE DE SEINE,0420,76410,76178,Cléon,76,,,76178000AN0165,,,,,,,,,,,,,0,1,Maison,120,4,S,sols,,,737,1.028968,49.321436
2020-1067791,2020-11-03,000001,Vente,160000,,,RUE DE SEINE,0420,76410,76178,Cléon,76,,,76178000AN0166,,,,,,,,,,,,,0,,,,,S,sols,,,36,1.029126,49.321624
2020-1068115,2020-11-23,000001,Vente,56000,55,,RUE LOUISE MICHEL,0270,76410,76178,Cléon,76,,,76178000AO0860,,,75,,,,,,,,,,1,3,Dépendance,,0,,,,,,1.031676,49.312528
2020-1068115,2020-11-23,000001,Vente,56000,55,,RUE LOUISE MICHEL,0270,76410,76178,Cléon,76,,,76178000AO0860,,,53,,,,,,,,,,1,3,Dépendance,,0,,,,,,1.031676,49.312528
2020-1068115,2020-11-23,000001,Vente,56000,55,,RUE LOUISE MICHEL,0270,76410,76178,Cléon,76,,,76178000AO0860,,,29,,,,,,,,,,1,2,Appartement,39,2,,,,,,1.031676,49.312528
2020-1068151,2020-11-25,000001,Vente,352289.47,,,LE MOULIN,B033,76410,76178,Cléon,76,,,76178000BA0021,,,,,,,,,,,,,0,,,,,T,terres,,,2138,,
2020-1068151,2020-11-25,000001,Vente,352289.47,,,LE MOULIN,B033,76410,76178,Cléon,76,,,76178000BA0022,,,,,,,,,,,,,0,,,,,T,terres,,,1138,,
2020-1068151,2020-11-25,000001,Vente,352289.47,,,LE MOULIN,B033,76410,76178,Cléon,76,,,76178000BA0023,,,,,,,,,,,,,0,,,,,T,terres,,,1298,,
2020-1068151,2020-11-25,000001,Vente,352289.47,,,LE MOULIN,B033,76410,76178,Cléon,76,,,76178000BA0024,,,,,,,,,,,,,0,,,,,T,terres,,,2159,,
2020-1068151,2020-11-25,000001,Vente,352289.47,,,LE MOULIN,B033,76410,76178,Cléon,76,,,76178000BA0025,,,,,,,,,,,,,0,,,,,T,terres,,,1927,,
2020-1068151,2020-11-25,000001,Vente,352289.47,,,LE MOULIN,B033,76410,76178,Cléon,76,,,76178000BA0026,,,,,,,,,,,,,0,,,,,J,jardins,,,738,,
2020-1068151,2020-11-25,000001,Vente,352289.47,,,LE MOULIN,B033,76410,76178,Cléon,76,,,76178000BA0026,,,,,,,,,,,,,0,,,,,S,sols,,,500,,
2020-1068151,2020-11-25,000001,Vente,352289.47,,,LE MOULIN,B033,76410,76178,Cléon,76,,,76178000BA0027,,,,,,,,,,,,,0,,,,,T,terres,,,1209,,
2020-1068151,2020-11-25,000001,Vente,352289.47,,,LE MOULIN,B033,76410,76178,Cléon,76,,,76178000BA0028,,,,,,,,,,,,,0,,,,,T,terres,,,4364,,
2020-1068151,2020-11-25,000001,Vente,352289.47,,,LE MOULIN,B033,76410,76178,Cléon,76,,,76178000BA0029,,,,,,,,,,,,,0,,,,,T,terres,,,2194,,
2020-1068152,2020-11-25,000002,Vente,,,,LE MOULIN,B033,76410,76178,Cléon,76,,,76178000BA0021,,,,,,,,,,,,,0,,,,,T,terres,,,2138,,
2020-1068152,2020-11-25,000002,Vente,,,,LE MOULIN,B033,76410,76178,Cléon,76,,,76178000BA0023,,,,,,,,,,,,,0,,,,,T,terres,,,1298,,
2020-1068152,2020-11-25,000002,Vente,,,,LE MOULIN,B033,76410,76178,Cléon,76,,,76178000BA0025,,,,,,,,,,,,,0,,,,,T,terres,,,1927,,
2020-1068152,2020-11-25,000002,Vente,,,,LE MOULIN,B033,76410,76178,Cléon,76,,,76178000BA0029,,,,,,,,,,,,,0,,,,,T,terres,,,2194,,
2020-1068183,2020-12-02,000001,Vente,78000,15,,RUE LOUISE MICHEL,0270,76410,76178,Cléon,76,,,76178000AO0860,,,98,,,,,,,,,,1,3,Dépendance,,0,,,,,,1.031676,49.312528
2020-1068183,2020-12-02,000001,Vente,78000,55,,RUE LOUISE MICHEL,0270,76410,76178,Cléon,76,,,76178000AO0860,,,73,,,,,,,,,,1,3,Dépendance,,0,,,,,,1.031676,49.312528
2020-1068183,2020-12-02,000001,Vente,78000,55,,RUE LOUISE MICHEL,0270,76410,76178,Cléon,76,,,76178000AO0860,,,27,52,,,,,,,,,1,2,Appartement,52,2,,,,,,1.031676,49.312528
2020-1068183,2020-12-02,000001,Vente,78000,55,,RUE LOUISE MICHEL,0270,76410,76178,Cléon,76,,,76178000AO0860,,,51,,,,,,,,,,1,3,Dépendance,,0,,,,,,1.031676,49.312528
2020-1068582,2020-12-30,000001,Vente,103500,84,,RUE DE LA LIBERTE,0200,76410,76178,Cléon,76,,,76178000AC0157,,,,,,,,,,,,,0,1,Maison,58,3,S,sols,,,500,1.018048,49.312024
2020-1068582,2020-12-30,000001,Vente,103500,84,,RUE DE LA LIBERTE,0200,76410,76178,Cléon,76,,,76178000AC0157,,,,,,,,,,,,,0,1,Maison,58,3,AG,terrains d'agrément,,,431,1.018048,49.312024
2020-1068676,2020-12-23,000001,Vente,169000,45,,RUE RODIN,0385,76410,76178,Cléon,76,,,76178000AE0486,,,,,,,,,,,,,0,1,Maison,81,4,S,sols,,,381,1.02658,49.308009
2020-1068686,2020-12-22,000002,Vente,25000,298,,RUE DES LILAS,0220,76410,76178,Cléon,76,,,76178000AO0897,,,,,,,,,,,,,0,1,Maison,78,4,S,sols,,,69,1.032109,49.316535
2020-1068686,2020-12-22,000002,Vente,25000,298,,RUE DES LILAS,0220,76410,76178,Cléon,76,,,76178000AO0897,,,,,,,,,,,,,0,3,Dépendance,,0,S,sols,,,69,1.032109,49.316535
2020-1068686,2020-12-22,000002,Vente,25000,298,,RUE DES LILAS,0220,76410,76178,Cléon,76,,,76178000AO0897,,,,,,,,,,,,,0,3,Dépendance,,0,S,sols,,,69,1.032109,49.316535
2020-1068686,2020-12-22,000002,Vente,25000,298,,RUE DES LILAS,0220,76410,76178,Cléon,76,,,76178000AO0897,,,,,,,,,,,,,0,3,Dépendance,,0,S,sols,,,69,1.032109,49.316535
