id_mutation,date_mutation,numero_disposition,nature_mutation,valeur_fonciere,adresse_numero,adresse_suffixe,adresse_nom_voie,adresse_code_voie,code_postal,code_commune,nom_commune,code_departement,ancien_code_commune,ancien_nom_commune,id_parcelle,ancien_id_parcelle,numero_volume,lot1_numero,lot1_surface_carrez,lot2_numero,lot2_surface_carrez,lot3_numero,lot3_surface_carrez,lot4_numero,lot4_surface_carrez,lot5_numero,lot5_surface_carrez,nombre_lots,code_type_local,type_local,surface_reelle_bati,nombre_pieces_principales,code_nature_culture,nature_culture,code_nature_culture_speciale,nature_culture_speciale,surface_terrain,longitude,latitude
2020-1085140,2020-01-23,000001,Vente,70000,155,,RUE DE L EGLISE,0025,76490,76626,Saint-Nicolas-de-la-Haie,76,,,766260000A0261,,,,,,,,,,,,,0,1,Maison,60,3,S,sols,,,86,0.623178,49.55496
2020-1085140,2020-01-23,000001,Vente,70000,,,LE MANOIR,B004,76490,76626,Saint-Nicolas-de-la-Haie,76,,,766260000A0263,,,,,,,,,,,,,0,,,,,S,sols,,,115,0.622896,49.554834
2020-1085221,2020-01-31,000001,Vente,140000,280,,RUE DU BOIS ROND,0012,76490,76626,Saint-Nicolas-de-la-Haie,76,,,766260000A0603,,,,,,,,,,,,,0,1,Maison,91,3,J,jardins,,,1060,0.626215,49.561049
2020-1085221,2020-01-31,000001,Vente,140000,280,,RUE DU BOIS ROND,0012,76490,76626,Saint-Nicolas-de-la-Haie,76,,,766260000A0603,,,,,,,,,,,,,0,1,Maison,91,3,S,sols,,,500,0.626215,49.561049
2020-1085221,2020-01-31,000001,Vente,140000,,,LA HAUTE RUE,B003,76490,76626,Saint-Nicolas-de-la-Haie,76,,,766260000A0636,,,,,,,,,,,,,0,,,,,J,jardins,,,2000,0.626514,49.560886
2020-1085221,2020-01-31,000001,Vente,140000,,,LA HAUTE RUE,B003,76490,76626,Saint-Nicolas-de-la-Haie,76,,,766260000A0662,,,,,,,,,,,,,0,,,,,BS,taillis sous futaie,,,3265,0.626975,49.56074
2020-1085241,2020-01-31,000001,Vente,36500,,,ST NICOLAS DE LA HAYE,B006,76490,76626,Saint-Nicolas-de-la-Haie,76,,,766260000A0748,,,,,,,,,,,,,0,,,,,AB,terrains a bâtir,,,1027,0.625954,49.554696
2020-1085362,2020-02-21,000001,Vente,103000,435,,RUE DE L EGLISE,0025,76490,76626,Saint-Nicolas-de-la-Haie,76,,,766260000A0739,,,,,,,,,,,,,0,1,Maison,78,2,,,,,,0.619937,49.556496
2020-1085543,2020-04-23,000001,Vente,48000,1220,,RUE DE LA HAUTE RUE,0047,76490,76626,Saint-Nicolas-de-la-Haie,76,,,766260000A0723,,,,,,,,,,,,,0,,,,,AB,terrains a bâtir,,,965,0.625534,49.564086
2020-1085770,2020-05-29,000001,Vente,275300,2025,,RUE DE LA HAUTE RUE,0047,76490,76626,Saint-Nicolas-de-la-Haie,76,,,766260000A0614,,,,,,,,,,,,,0,1,Maison,180,4,S,sols,,,500,0.616187,49.567443
2020-1085770,2020-05-29,000001,Vente,275300,2025,,RUE DE LA HAUTE RUE,0047,76490,76626,Saint-Nicolas-de-la-Haie,76,,,766260000A0614,,,,,,,,,,,,,0,1,Maison,180,4,J,jardins,,,2713,0.616187,49.567443
2020-1085892,2020-06-12,000001,Vente,38000,,,ST NICOLAS DE LA HAYE,B006,76490,76626,Saint-Nicolas-de-la-Haie,76,,,766260000A0747,,,,,,,,,,,,,0,,,,,AB,terrains a bâtir,,,1039,0.625808,49.554782
2020-1086073,2020-07-08,000001,Vente,196500,85,,IMP DE LA HAUTE RUE,0045,76490,76626,Saint-Nicolas-de-la-Haie,76,,,766260000A0606,,,,,,,,,,,,,0,1,Maison,132,5,P,prés,,,1407,0.623166,49.564221
2020-1086073,2020-07-08,000001,Vente,196500,85,,IMP DE LA HAUTE RUE,0045,76490,76626,Saint-Nicolas-de-la-Haie,76,,,766260000A0606,,,,,,,,,,,,,0,1,Maison,132,5,P,prés,,,1408,0.623166,49.564221
2020-1086073,2020-07-08,000001,Vente,196500,85,,IMP DE LA HAUTE RUE,0045,76490,76626,Saint-Nicolas-de-la-Haie,76,,,766260000A0606,,,,,,,,,,,,,0,1,Maison,132,5,S,sols,,,500,0.623166,49.564221
2020-1086560,2020-09-21,000001,Vente,135000,460,,RUE DE L EGLISE,0025,76490,76626,Saint-Nicolas-de-la-Haie,76,,,766260000A0737,,,,,,,,,,,,,0,1,Maison,120,4,S,sols,,,505,0.619814,49.556442
2020-1086574,2020-10-19,000001,Vente,50000,495,,RUE DE LA HAUTE RUE,0047,76490,76626,Saint-Nicolas-de-la-Haie,76,,,766260000A0587,,,,,,,,,,,,,0,1,Maison,48,2,S,sols,,,500,0.628941,49.558446
2020-1086574,2020-10-19,000001,Vente,50000,495,,RUE DE LA HAUTE RUE,0047,76490,76626,Saint-Nicolas-de-la-Haie,76,,,766260000A0587,,,,,,,,,,,,,0,1,Maison,48,2,J,jardins,,,842,0.628941,49.558446
2020-1086786,2020-11-13,000001,Vente,159000,1235,,RUE DE LA HAUTE RUE,0047,76490,76626,Saint-Nicolas-de-la-Haie,76,,,766260000A0684,,,,,,,,,,,,,0,1,Maison,90,4,S,sols,,,1000,0.625373,49.564409
2020-1086922,2020-12-08,000001,Vente,40000,,,ST NICOLAS DE LA HAYE,B006,76490,76626,Saint-Nicolas-de-la-Haie,76,,,766260000A0749,,,,,,,,,,,,,0,,,,,AB,terrains a bâtir,,,1289,0.626168,49.554557
2020-1087173,2020-12-18,000002,Vente,50000,,,SAINTE MARIE,B005,76490,76626,Saint-Nicolas-de-la-Haie,76,,,766260000A0668,,,,,,,,,,,,,0,,,,,P,prés,,,2069,0.618831,49.557447
2020-1087173,2020-12-18,000002,Vente,50000,,,SAINTE MARIE,B005,76490,76626,Saint-Nicolas-de-la-Haie,76,,,766260000A0752,,,,,,,,,,,,,0,,,,,P,prés,,,990,0.618434,49.556949
