id_mutation,date_mutation,numero_disposition,nature_mutation,valeur_fonciere,adresse_numero,adresse_suffixe,adresse_nom_voie,adresse_code_voie,code_postal,code_commune,nom_commune,code_departement,ancien_code_commune,ancien_nom_commune,id_parcelle,ancien_id_parcelle,numero_volume,lot1_numero,lot1_surface_carrez,lot2_numero,lot2_surface_carrez,lot3_numero,lot3_surface_carrez,lot4_numero,lot4_surface_carrez,lot5_numero,lot5_surface_carrez,nombre_lots,code_type_local,type_local,surface_reelle_bati,nombre_pieces_principales,code_nature_culture,nature_culture,code_nature_culture_speciale,nature_culture_speciale,surface_terrain,longitude,latitude
2020-1069281,2020-01-14,000001,Vente,210500,6003,,LE VILLAGE,B024,76530,76759,Yville-sur-Seine,76,,,767590000D0178,,,,,,,,,,,,,0,1,Maison,117,5,VE,vergers,,,1257,0.879046,49.399882
2020-1069281,2020-01-14,000001,Vente,210500,,,LE VILLAGE,B024,76530,76759,Yville-sur-Seine,76,,,767590000D0224,,,,,,,,,,,,,0,,,,,S,sols,,,76,,
2020-1069281,2020-01-14,000001,Vente,210500,,,LE VILLAGE,B024,76530,76759,Yville-sur-Seine,76,,,767590000D0225,,,,,,,,,,,,,0,,,,,VE,vergers,,,513,,
2020-1069281,2020-01-14,000001,Vente,210500,,,LE VILLAGE,B024,76530,76759,Yville-sur-Seine,76,,,767590000D0226,,,,,,,,,,,,,0,,,,,VE,vergers,,,4,,
2020-1069343,2020-02-14,000002,Echange,250,,,CLOS DES PARADIS,B002,76530,76759,Yville-sur-Seine,76,,,767590000D0322,,,,,,,,,,,,,0,,,,,VE,vergers,,,47,0.868315,49.396271
2020-1069343,2020-02-14,000002,Echange,250,,,CLOS DES PARADIS,B002,76530,76759,Yville-sur-Seine,76,,,767590000D0323,,,,,,,,,,,,,0,,,,,VE,vergers,,,175,0.868504,49.396374
2020-1069384,2020-02-13,000001,Vente,23000,,,PETITE PRAIRIE,B020,76530,76759,Yville-sur-Seine,76,,,767590000A0110,,,,,,,,,,,,,0,,,,,P,prés,,,22030,0.877619,49.41582
2020-1069643,2020-03-06,000001,Vente,110000,5081,,FERME DU TILLEUL,B007,76530,76759,Yville-sur-Seine,76,,,767590000B0461,,,,,,,,,,,,,0,1,Maison,67,4,VE,vergers,,,4774,0.891617,49.416221
2020-1069643,2020-03-06,000001,Vente,110000,5081,,FERME DU TILLEUL,B007,76530,76759,Yville-sur-Seine,76,,,767590000B0461,,,,,,,,,,,,,0,1,Maison,67,4,S,sols,,,912,0.891617,49.416221
2020-1069952,2020-04-30,000001,Vente,5975000,,,GRANDE BOULTIERE,B011,76530,76759,Yville-sur-Seine,76,,,767590000B0237,,,,,,,,,,,,,0,,,,,BS,taillis sous futaie,,,11119,0.901728,49.411701
2020-1069975,2020-04-30,000001,Vente,186000,,,CLOS AU LOUP,B001,76530,76759,Yville-sur-Seine,76,,,767590000B0472,,,,,,,,,,,,,0,,,,,P,prés,,,206,0.891712,49.425225
2020-1069975,2020-04-30,000001,Vente,186000,7023,,RUE CHRISTINE,0120,76530,76759,Yville-sur-Seine,76,,,767590000B0473,,,,,,,,,,,,,0,1,Maison,109,4,P,prés,,,883,0.89111,49.425216
2020-1069975,2020-04-30,000001,Vente,186000,7023,,RUE CHRISTINE,0120,76530,76759,Yville-sur-Seine,76,,,767590000B0473,,,,,,,,,,,,,0,1,Maison,109,4,VE,vergers,,,882,0.89111,49.425216
2020-1070215,2020-05-12,000001,Vente,120000,5056,,GRANDE PRAIRIE,B014,76530,76759,Yville-sur-Seine,76,,,767590000A0296,,,,,,,,,,,,,0,1,Maison,52,4,AG,terrains d'agrément,,,1214,0.873711,49.413074
2020-1070215,2020-05-12,000001,Vente,120000,5056,,GRANDE PRAIRIE,B014,76530,76759,Yville-sur-Seine,76,,,767590000A0296,,,,,,,,,,,,,0,1,Maison,52,4,S,sols,,,500,0.873711,49.413074
2020-1070215,2020-05-12,000001,Vente,120000,,,GRANDE PRAIRIE,B014,76530,76759,Yville-sur-Seine,76,,,767590000A0297,,,,,,,,,,,,,0,,,,,AG,terrains d'agrément,,,1074,0.874323,49.413274
2020-1070215,2020-05-12,000001,Vente,120000,,,GRANDE PRAIRIE,B014,76530,76759,Yville-sur-Seine,76,,,767590000A0298,,,,,,,,,,,,,0,,,,,AG,terrains d'agrément,,,1015,0.874369,49.413081
2020-1070215,2020-05-12,000001,Vente,120000,,,GRANDE PRAIRIE,B014,76530,76759,Yville-sur-Seine,76,,,767590000A0299,,,,,,,,,,,,,0,,,,,S,sols,,,260,0.873837,49.412962
2020-1070215,2020-05-12,000001,Vente,120000,,,GRANDE PRAIRIE,B014,76530,76759,Yville-sur-Seine,76,,,767590000A0300,,,,,,,,,,,,,0,,,,,VE,vergers,,,4183,0.875583,49.413673
2020-1070391,2020-06-08,000001,Vente,141145,5098,,FERME DU TILLEUL,B007,76530,76759,Yville-sur-Seine,76,,,767590000B0460,,,,,,,,,,,,,0,1,Maison,80,3,S,sols,,,694,0.890592,49.412424
2020-1070391,2020-06-08,000001,Vente,141145,5098,,FERME DU TILLEUL,B007,76530,76759,Yville-sur-Seine,76,,,767590000B0460,,,,,,,,,,,,,0,1,Maison,80,3,VE,vergers,,,1526,0.890592,49.412424
2020-1072045,2020-10-12,000001,Vente,163000,6022,,LE SABLON,B022,76530,76759,Yville-sur-Seine,76,,,767590000B0361,,,,,,,,,,,,,0,1,Maison,85,5,P,prés,,,2095,0.89356,49.41982
2020-1072045,2020-10-12,000001,Vente,163000,6022,,LE SABLON,B022,76530,76759,Yville-sur-Seine,76,,,767590000B0361,,,,,,,,,,,,,0,1,Maison,85,5,S,sols,,,80,0.89356,49.41982
2020-1072377,2020-11-06,000001,Vente,3500,,,TRIAGE DE L ESSART,B023,76530,76759,Yville-sur-Seine,76,,,767590000B0228,,,,,,,,,,,,,0,,,,,BS,taillis sous futaie,,,3380,0.902873,49.414827
2020-1072734,2020-11-30,000002,Vente,85000,,,CLOS AU LOUP,B001,76530,76759,Yville-sur-Seine,76,,,767590000B0541,,,,,,,,,,,,,0,,,,,T,terres,,,123,0.892403,49.418682
2020-1072734,2020-11-30,000002,Vente,85000,5086,,CLOS AU LOUP,B001,76530,76759,Yville-sur-Seine,76,,,767590000B0543,,,,,,,,,,,,,0,1,Maison,63,3,,,,,,0.892367,49.418347
2020-1073076,2020-12-18,000001,Vente,14198,,,GRANDE PRAIRIE,B014,76530,76759,Yville-sur-Seine,76,,,767590000A0188,,,,,,,,,,,,,0,,,,,T,terres,,,23664,0.875633,49.409444
