id_mutation,date_mutation,numero_disposition,nature_mutation,valeur_fonciere,adresse_numero,adresse_suffixe,adresse_nom_voie,adresse_code_voie,code_postal,code_commune,nom_commune,code_departement,ancien_code_commune,ancien_nom_commune,id_parcelle,ancien_id_parcelle,numero_volume,lot1_numero,lot1_surface_carrez,lot2_numero,lot2_surface_carrez,lot3_numero,lot3_surface_carrez,lot4_numero,lot4_surface_carrez,lot5_numero,lot5_surface_carrez,nombre_lots,code_type_local,type_local,surface_reelle_bati,nombre_pieces_principales,code_nature_culture,nature_culture,code_nature_culture_speciale,nature_culture_speciale,surface_terrain,longitude,latitude
2020-1104364,2020-01-09,000001,Vente,80000,9006,,DERRIERE LES MOULINS,B012,77450,77474,Trilbardou,77,,,77474000AB0091,,,,,,,,,,,,,0,1,Maison,11,1,S,sols,,,418,2.794039,48.949157
2020-1104364,2020-01-09,000001,Vente,80000,9006,,DERRIERE LES MOULINS,B012,77450,77474,Trilbardou,77,,,77474000AB0091,,,,,,,,,,,,,0,1,Maison,11,1,S,sols,,,418,2.794039,48.949157
2020-1104364,2020-01-09,000001,Vente,80000,9006,,DERRIERE LES MOULINS,B012,77450,77474,Trilbardou,77,,,77474000AB0091,,,,,,,,,,,,,0,1,Maison,11,1,S,sols,,,418,2.794039,48.949157
2020-1104364,2020-01-09,000001,Vente,80000,9006,,DERRIERE LES MOULINS,B012,77450,77474,Trilbardou,77,,,77474000AB0091,,,,,,,,,,,,,0,1,Maison,11,1,S,sols,,,418,2.794039,48.949157
2020-1104364,2020-01-09,000001,Vente,80000,9006,,DERRIERE LES MOULINS,B012,77450,77474,Trilbardou,77,,,77474000AB0091,,,,,,,,,,,,,0,1,Maison,11,1,S,sols,,,418,2.794039,48.949157
2020-1104364,2020-01-09,000001,Vente,80000,,,DERRIERE LES MOULINS,B012,77450,77474,Trilbardou,77,,,77474000AB0094,,,,,,,,,,,,,0,,,,,S,sols,,,903,2.79393,48.949294
2020-1105968,2020-03-02,000001,Vente,60000,354,D,RTE DE CHARMENTRAY,0060,77450,77474,Trilbardou,77,,,77474000AB0146,,,,,,,,,,,,,0,1,Maison,38,2,S,sols,,,363,2.791422,48.949038
2020-1106204,2020-02-27,000001,Vente,310000,16,,RUE DU MARECHAL GALLIENI,0200,77450,77474,Trilbardou,77,,,77474000AC0344,,,,,,,,,,,,,0,1,Maison,84,5,S,sols,,,544,2.807218,48.943018
2020-1106508,2020-03-10,000001,Vente,115000,,,RUE EMILE ET ROBERT DEBEAUPUIS,0120,77450,77474,Trilbardou,77,,,77474000AC0646,,,,,,,,,,,,,0,,,,,AB,terrains a bâtir,,,249,2.804059,48.943592
2020-1106609,2020-03-13,000001,Vente,402000,9,,RUE DES CORNOUILLERS,0090,77450,77474,Trilbardou,77,,,77474000AC0407,,,,,,,,,,,,,0,,,,,J,jardins,POTAG,Jardin potager,45,2.808296,48.940523
2020-1106609,2020-03-13,000001,Vente,402000,9,,RUE DES CORNOUILLERS,0090,77450,77474,Trilbardou,77,,,77474000AC0418,,,,,,,,,,,,,0,1,Maison,161,5,J,jardins,POTAG,Jardin potager,106,2.808373,48.940464
2020-1106609,2020-03-13,000001,Vente,402000,9,,RUE DES CORNOUILLERS,0090,77450,77474,Trilbardou,77,,,77474000AC0418,,,,,,,,,,,,,0,1,Maison,161,5,S,sols,,,500,2.808373,48.940464
2020-1106922,2020-04-30,000001,Vente,137000,24,,RUE DE LA LIBERATION,0180,77450,77474,Trilbardou,77,,,77474000AC0158,,,4,,,,,,,,,,1,3,Dépendance,,0,,,,,,2.806342,48.941173
2020-1106922,2020-04-30,000001,Vente,137000,24,,RUE DE LA LIBERATION,0180,77450,77474,Trilbardou,77,,,77474000AC0158,,,2,35.59,,,,,,,,,1,2,Appartement,32,3,,,,,,2.806342,48.941173
2020-1107270,2020-04-27,000001,Vente,385000,8,,RUE DE LA LIBERATION,0180,77450,77474,Trilbardou,77,,,77474000AC0171,,,,,,,,,,,,,0,1,Maison,168,7,S,sols,,,433,2.805766,48.942257
2020-1107598,2020-05-28,000001,Vente,15000,,,LA MONTAGNE,B024,77450,77474,Trilbardou,77,,,77474000AB0001,,,,,,,,,,,,,0,,,,,BT,taillis simples,,,320,2.791125,48.950291
2020-1107598,2020-05-28,000001,Vente,15000,,,LA MONTAGNE,B024,77450,77474,Trilbardou,77,,,77474000AB0020,,,,,,,,,,,,,0,,,,,BT,taillis simples,,,161,2.79384,48.950345
2020-1107598,2020-05-28,000001,Vente,15000,,,LA MONTAGNE,B024,77450,77474,Trilbardou,77,,,77474000AB0025,,,,,,,,,,,,,0,,,,,BT,taillis simples,,,171,2.794451,48.950327
2020-1107598,2020-05-28,000001,Vente,15000,,,LA MONTAGNE,B024,77450,77474,Trilbardou,77,,,77474000AB0031,,,,,,,,,,,,,0,,,,,BT,taillis simples,,,510,2.795439,48.950229
2020-1107598,2020-05-28,000001,Vente,15000,,,LA MONTAGNE,B024,77450,77474,Trilbardou,77,,,77474000AB0044,,,,,,,,,,,,,0,,,,,BT,taillis simples,,,88,2.801063,48.948299
2020-1107598,2020-05-28,000001,Vente,15000,,,DERRIERE LES MOULINS,B012,77450,77474,Trilbardou,77,,,77474000AB0082,,,,,,,,,,,,,0,,,,,BT,taillis simples,,,700,2.794822,48.949156
2020-1107598,2020-05-28,000001,Vente,15000,9008,,DERRIERE LES MOULINS,B012,77450,77474,Trilbardou,77,,,77474000AB0100,,,,,,,,,,,,,0,1,Maison,35,1,BT,taillis simples,,,770,2.793411,48.948734
2020-1107598,2020-05-28,000001,Vente,15000,,,DERRIERE LES MOULINS,B012,77450,77474,Trilbardou,77,,,77474000AB0115,,,,,,,,,,,,,0,,,,,BT,taillis simples,,,408,2.791822,48.948724
2020-1110573,2020-09-10,000001,Vente,147000,87,,RTE DE CHARMENTRAY,0060,77450,77474,Trilbardou,77,,,77474000AB0133,,,,,,,,,,,,,0,1,Maison,61,3,S,sols,,,544,2.795326,48.948402
2020-1111169,2020-09-07,000001,Vente,137529.5,8,,RUE REINE BARBILLON,0306,77450,77474,Trilbardou,77,,,774740000Y0134,,,,,,,,,,,,,0,,,,,AB,terrains a bâtir,,,7,2.808493,48.938991
2020-1111169,2020-09-07,000001,Vente,137529.5,8,,RUE REINE BARBILLON,0306,77450,77474,Trilbardou,77,,,774740000Y0144,,,,,,,,,,,,,0,,,,,AB,terrains a bâtir,,,308,2.808512,48.938894
2020-1111169,2020-09-07,000001,Vente,137529.5,8,,RUE REINE BARBILLON,0306,77450,77474,Trilbardou,77,,,774740000Y0155,,,,,,,,,,,,,0,,,,,AB,terrains a bâtir,,,104,2.808601,48.938733
2020-1111821,2020-10-06,000001,Vente,219000,6,,IMP DE L HARMONIE,0140,77450,77474,Trilbardou,77,,,77474000AC0031,,,,,,,,,,,,,0,1,Maison,61,4,S,sols,,,151,2.806959,48.94267
2020-1111821,2020-10-06,000001,Vente,219000,,,TRILBARDOU,B037,77450,77474,Trilbardou,77,,,77474000AC0033,,,,,,,,,,,,,0,,,,,J,jardins,POTAG,Jardin potager,415,2.807022,48.942483
2020-1112534,2020-10-29,000001,Vente,20066.8,,,LA MONTAGNE,B024,77450,77474,Trilbardou,77,,,77474000AB0001,,,,,,,,,,,,,0,,,,,BT,taillis simples,,,320,2.791125,48.950291
2020-1112534,2020-10-29,000001,Vente,20066.8,,,LA MONTAGNE,B024,77450,77474,Trilbardou,77,,,77474000AB0020,,,,,,,,,,,,,0,,,,,BT,taillis simples,,,161,2.79384,48.950345
2020-1112534,2020-10-29,000001,Vente,20066.8,,,LA MONTAGNE,B024,77450,77474,Trilbardou,77,,,77474000AB0025,,,,,,,,,,,,,0,,,,,BT,taillis simples,,,171,2.794451,48.950327
2020-1112534,2020-10-29,000001,Vente,20066.8,,,LA MONTAGNE,B024,77450,77474,Trilbardou,77,,,77474000AB0031,,,,,,,,,,,,,0,,,,,BT,taillis simples,,,510,2.795439,48.950229
2020-1112534,2020-10-29,000001,Vente,20066.8,,,LA MONTAGNE,B024,77450,77474,Trilbardou,77,,,77474000AB0044,,,,,,,,,,,,,0,,,,,BT,taillis simples,,,88,2.801063,48.948299
2020-1112534,2020-10-29,000001,Vente,20066.8,,,DERRIERE LES MOULINS,B012,77450,77474,Trilbardou,77,,,77474000AB0082,,,,,,,,,,,,,0,,,,,BT,taillis simples,,,700,2.794822,48.949156
2020-1112534,2020-10-29,000001,Vente,20066.8,9008,,DERRIERE LES MOULINS,B012,77450,77474,Trilbardou,77,,,77474000AB0100,,,,,,,,,,,,,0,1,Maison,35,1,BT,taillis simples,,,770,2.793411,48.948734
2020-1112534,2020-10-29,000001,Vente,20066.8,,,DERRIERE LES MOULINS,B012,77450,77474,Trilbardou,77,,,77474000AB0115,,,,,,,,,,,,,0,,,,,BT,taillis simples,,,408,2.791822,48.948724
2020-1113148,2020-11-13,000001,Vente,60000,354,C,RTE DE CHARMENTRAY,0060,77450,77474,Trilbardou,77,,,77474000AB0145,,,,,,,,,,,,,0,3,Dépendance,,0,S,sols,,,367,2.791404,48.949214
2020-1113602,2020-11-13,000001,Vente,110000,324,,RTE DE CHARMENTRAY,0060,77450,77474,Trilbardou,77,,,77474000AB0140,,,,,,,,,,,,,0,1,Maison,48,3,S,sols,,,344,2.791725,48.949557
