id_mutation,date_mutation,numero_disposition,nature_mutation,valeur_fonciere,adresse_numero,adresse_suffixe,adresse_nom_voie,adresse_code_voie,code_postal,code_commune,nom_commune,code_departement,ancien_code_commune,ancien_nom_commune,id_parcelle,ancien_id_parcelle,numero_volume,lot1_numero,lot1_surface_carrez,lot2_numero,lot2_surface_carrez,lot3_numero,lot3_surface_carrez,lot4_numero,lot4_surface_carrez,lot5_numero,lot5_surface_carrez,nombre_lots,code_type_local,type_local,surface_reelle_bati,nombre_pieces_principales,code_nature_culture,nature_culture,code_nature_culture_speciale,nature_culture_speciale,surface_terrain,longitude,latitude
2020-1135041,2020-01-08,000001,Vente,125000,9,,ALL DU JAMBOREE,0540,78840,78410,Moisson,78,,,78410000AA0168,,,,,,,,,,,,,0,1,Maison,60,2,S,sols,,,385,1.665122,49.072407
2020-1135041,2020-01-08,000001,Vente,125000,,,LE HAUT DU CLOS,B037,78840,78410,Moisson,78,,,784100000B0832,,,,,,,,,,,,,0,,,,,BT,taillis simples,,,230,1.664503,49.072126
2020-1135041,2020-01-08,000001,Vente,125000,,,LE HAUT DU CLOS,B037,78840,78410,Moisson,78,,,784100000B0833,,,,,,,,,,,,,0,,,,,BT,taillis simples,,,120,1.664513,49.072053
2020-1135102,2020-01-17,000001,Vente,43000,21,,PROM CLAUDE MONET,0330,78840,78410,Moisson,78,,,784100000D0489,,,,,,,,,,,,,0,1,Maison,75,4,S,sols,,,84,1.69501,49.062034
2020-1135102,2020-01-17,000001,Vente,43000,,,LAVACOURT SUD,B055,78840,78410,Moisson,78,,,784100000D1422,,,,,,,,,,,,,0,,,,,S,sols,,,167,1.69514,49.061987
2020-1135200,2020-01-27,000001,Vente,100000,14,B,RTE DE MOISSON,0690,78840,78410,Moisson,78,,,784100000D1033,,,,,,,,,,,,,0,1,Maison,20,1,S,sols,,,500,1.68938,49.066329
2020-1135200,2020-01-27,000001,Vente,100000,14,B,RTE DE MOISSON,0690,78840,78410,Moisson,78,,,784100000D1033,,,,,,,,,,,,,0,1,Maison,20,1,AG,terrains d'agrément,JARD,Jardin d'agrément,639,1.68938,49.066329
2020-1135201,2020-01-27,000001,Vente,469300,,,LA GREVE,B035,78840,78410,Moisson,78,,,784100000D0605,,,,,,,,,,,,,0,,,,,T,terres,,,1042,1.692922,49.058611
2020-1135201,2020-01-27,000001,Vente,469300,62,,PROM CLAUDE MONET,0330,78840,78410,Moisson,78,,,784100000D0606,,,,,,,,,,,,,0,1,Maison,250,8,S,sols,,,540,1.693459,49.058545
2020-1135201,2020-01-27,000001,Vente,469300,,,LA GREVE,B035,78840,78410,Moisson,78,,,784100000D0607,,,,,,,,,,,,,0,,,,,T,terres,,,539,1.693024,49.058487
2020-1135201,2020-01-27,000001,Vente,469300,,,LA GREVE,B035,78840,78410,Moisson,78,,,784100000D0927,,,,,,,,,,,,,0,,,,,P,prés,,,995,1.692538,49.058872
2020-1135202,2020-01-27,000001,Vente,289000,7,,RUE DES MARES,0660,78840,78410,Moisson,78,,,78410000AB0336,,,,,,,,,,,,,0,1,Maison,125,7,S,sols,,,500,1.670455,49.074017
2020-1135202,2020-01-27,000001,Vente,289000,7,,RUE DES MARES,0660,78840,78410,Moisson,78,,,78410000AB0336,,,,,,,,,,,,,0,1,Maison,125,7,AG,terrains d'agrément,JARD,Jardin d'agrément,408,1.670455,49.074017
2020-1135202,2020-01-27,000001,Vente,289000,,,RUE DES MARES,0660,78840,78410,Moisson,78,,,78410000AB0338,,,,,,,,,,,,,0,,,,,AG,terrains d'agrément,JARD,Jardin d'agrément,142,1.670632,49.073989
2020-1135425,2020-02-14,000001,Vente,170000,3,B,CHE DES GRAVIERS,0480,78840,78410,Moisson,78,,,78410000AA0217,,,,,,,,,,,,,0,1,Maison,89,4,S,sols,,,1000,1.664934,49.075344
2020-1135425,2020-02-14,000001,Vente,170000,3,B,CHE DES GRAVIERS,0480,78840,78410,Moisson,78,,,78410000AA0217,,,,,,,,,,,,,0,1,Maison,89,4,AG,terrains d'agrément,JARD,Jardin d'agrément,281,1.664934,49.075344
2020-1135425,2020-02-14,000001,Vente,170000,97,,CHE DES GRAVIERS,0480,78840,78410,Moisson,78,,,78410000AA0219,,,,,,,,,,,,,0,,,,,AG,terrains d'agrément,JARD,Jardin d'agrément,221,1.664849,49.075012
2020-1135495,2020-03-09,000001,Vente,8099,,,LES BRULINS,B007,78840,78410,Moisson,78,,,784100000A0812,,,,,,,,,,,,,0,,,,,BT,taillis simples,,,340,1.653792,49.073248
2020-1135495,2020-03-09,000001,Vente,8099,,,LES BRULINS,B007,78840,78410,Moisson,78,,,784100000A0916,,,,,,,,,,,,,0,,,,,BT,taillis simples,,,195,1.657795,49.071945
2020-1135495,2020-03-09,000001,Vente,8099,,,LES BRULINS,B007,78840,78410,Moisson,78,,,784100000A0955,,,,,,,,,,,,,0,,,,,BT,taillis simples,,,520,1.656205,49.071628
2020-1135495,2020-03-09,000001,Vente,8099,,,LES RELES,B071,78840,78410,Moisson,78,,,784100000A1035,,,,,,,,,,,,,0,,,,,BT,taillis simples,,,480,1.653252,49.072283
2020-1135495,2020-03-09,000001,Vente,8099,,,LES RELES,B071,78840,78410,Moisson,78,,,784100000A1054,,,,,,,,,,,,,0,,,,,BT,taillis simples,,,120,1.652469,49.071679
2020-1135495,2020-03-09,000001,Vente,8099,,,LES RELES,B071,78840,78410,Moisson,78,,,784100000A1131,,,,,,,,,,,,,0,,,,,BT,taillis simples,,,375,1.649868,49.072339
2020-1135495,2020-03-09,000001,Vente,8099,,,LES RELES,B071,78840,78410,Moisson,78,,,784100000A1147,,,,,,,,,,,,,0,,,,,BT,taillis simples,,,120,1.649759,49.071764
2020-1135495,2020-03-09,000001,Vente,8099,,,LES DOUILLETTES,B022,78840,78410,Moisson,78,,,784100000E0025,,,,,,,,,,,,,0,,,,,BT,taillis simples,,,380,1.668743,49.059359
2020-1135495,2020-03-09,000001,Vente,8099,,,LES DOUILLETTES,B022,78840,78410,Moisson,78,,,784100000E0057,,,,,,,,,,,,,0,,,,,BT,taillis simples,,,550,1.670549,49.05988
2020-1135495,2020-03-09,000001,Vente,8099,,,LES DOUILLETTES,B022,78840,78410,Moisson,78,,,784100000E0066,,,,,,,,,,,,,0,,,,,BT,taillis simples,,,285,1.670991,49.060441
2020-1135495,2020-03-09,000001,Vente,8099,,,LES DOUILLETTES,B022,78840,78410,Moisson,78,,,784100000E0101,,,,,,,,,,,,,0,,,,,BT,taillis simples,,,350,1.672691,49.061173
2020-1135495,2020-03-09,000001,Vente,8099,,,LES CRANIERES D EN HAUT,B017,78840,78410,Moisson,78,,,784100000E0455,,,,,,,,,,,,,0,,,,,BT,taillis simples,,,175,1.673431,49.059574
2020-1135495,2020-03-09,000001,Vente,8099,,,LES CRANIERES D EN HAUT,B017,78840,78410,Moisson,78,,,784100000E0528,,,,,,,,,,,,,0,,,,,BT,taillis simples,,,556,1.671776,49.059484
2020-1135495,2020-03-09,000001,Vente,8099,,,LA CROIX D EN HAUT,B019,78840,78410,Moisson,78,,,784100000E0600,,,,,,,,,,,,,0,,,,,BT,taillis simples,,,215,1.669893,49.058882
2020-1135495,2020-03-09,000001,Vente,8099,,,LA CROIX D EN HAUT,B019,78840,78410,Moisson,78,,,784100000E0614,,,,,,,,,,,,,0,,,,,BT,taillis simples,,,180,1.670299,49.058216
2020-1135495,2020-03-09,000001,Vente,8099,,,LES CRANIERES D EN HAUT,B017,78840,78410,Moisson,78,,,784100000E1393,,,,,,,,,,,,,0,,,,,BT,taillis simples,,,558,1.671697,49.05864
2020-1135496,2020-03-09,000001,Vente,20092,,,SOUS L EGLISE,B075,78840,78410,Moisson,78,,,784100000A0363,,,,,,,,,,,,,0,,,,,T,terres,,,710,1.655274,49.075433
2020-1135496,2020-03-09,000001,Vente,20092,,,SOUS L EGLISE,B075,78840,78410,Moisson,78,,,784100000A0381,,,,,,,,,,,,,0,,,,,T,terres,,,333,1.656185,49.075379
2020-1135496,2020-03-09,000001,Vente,20092,,,LE FOND PECHEUR,B027,78840,78410,Moisson,78,,,784100000A0410,,,,,,,,,,,,,0,,,,,T,terres,,,650,1.65798,49.075263
2020-1135496,2020-03-09,000001,Vente,20092,,,DERRIERE L EGLISE,B021,78840,78410,Moisson,78,,,784100000A0551,,,,,,,,,,,,,0,,,,,T,terres,,,56,1.655457,49.074721
2020-1135496,2020-03-09,000001,Vente,20092,,,DERRIERE L EGLISE,B021,78840,78410,Moisson,78,,,784100000A0581,,,,,,,,,,,,,0,,,,,T,terres,,,470,1.654293,49.074042
2020-1135496,2020-03-09,000001,Vente,20092,,,DERRIERE L EGLISE,B021,78840,78410,Moisson,78,,,784100000A0582,,,,,,,,,,,,,0,,,,,T,terres,,,286,1.654508,49.074599
2020-1135496,2020-03-09,000001,Vente,20092,,,DERRIERE L EGLISE,B021,78840,78410,Moisson,78,,,784100000A0586,,,,,,,,,,,,,0,,,,,T,terres,,,210,1.65418,49.074097
2020-1135496,2020-03-09,000001,Vente,20092,,,DERRIERE L EGLISE,B021,78840,78410,Moisson,78,,,784100000A0588,,,,,,,,,,,,,0,,,,,T,terres,,,438,1.654263,49.074458
2020-1135496,2020-03-09,000001,Vente,20092,,,DERRIERE L EGLISE,B021,78840,78410,Moisson,78,,,784100000A0591,,,,,,,,,,,,,0,,,,,T,terres,,,444,1.654129,49.074471
2020-1135496,2020-03-09,000001,Vente,20092,,,DERRIERE L EGLISE,B021,78840,78410,Moisson,78,,,784100000A0592,,,,,,,,,,,,,0,,,,,T,terres,,,165,1.653895,49.073924
2020-1135496,2020-03-09,000001,Vente,20092,,,LES PRESIDANES,B070,78840,78410,Moisson,78,,,784100000A0661,,,,,,,,,,,,,0,,,,,BT,taillis simples,,,550,1.651651,49.074577
2020-1135496,2020-03-09,000001,Vente,20092,,,LES PRESIDANES,B070,78840,78410,Moisson,78,,,784100000A0737,,,,,,,,,,,,,0,,,,,BT,taillis simples,,,225,1.650691,49.073364
2020-1135496,2020-03-09,000001,Vente,20092,,,LES PRESIDANES,B070,78840,78410,Moisson,78,,,784100000A0742,,,,,,,,,,,,,0,,,,,BT,taillis simples,,,200,1.650246,49.07316
2020-1135496,2020-03-09,000001,Vente,20092,,,LES PRESIDANES,B070,78840,78410,Moisson,78,,,784100000A0745,,,,,,,,,,,,,0,,,,,BT,taillis simples,,,330,1.650021,49.073121
2020-1135496,2020-03-09,000001,Vente,20092,,,LES BRULINS,B007,78840,78410,Moisson,78,,,784100000A0815,,,,,,,,,,,,,0,,,,,BT,taillis simples,,,260,1.653902,49.073249
2020-1135496,2020-03-09,000001,Vente,20092,,,LES BRULINS,B007,78840,78410,Moisson,78,,,784100000A0816,,,,,,,,,,,,,0,,,,,BT,taillis simples,,,350,1.65394,49.073247
2020-1135496,2020-03-09,000001,Vente,20092,,,LES BRULINS,B007,78840,78410,Moisson,78,,,784100000A0900,,,,,,,,,,,,,0,,,,,BT,taillis simples,,,1275,1.657936,49.072587
2020-1135496,2020-03-09,000001,Vente,20092,,,LES BRULINS,B007,78840,78410,Moisson,78,,,784100000A0957,,,,,,,,,,,,,0,,,,,BT,taillis simples,,,690,1.656091,49.071609
2020-1135496,2020-03-09,000001,Vente,20092,,,LES AJOUS,B001,78840,78410,Moisson,78,,,78410000AB0035,,,,,,,,,,,,,0,,,,,T,terres,,,475,1.673278,49.074066
2020-1135496,2020-03-09,000001,Vente,20092,,,LES MONETTES,B060,78840,78410,Moisson,78,,,784100000C0171,,,,,,,,,,,,,0,,,,,BT,taillis simples,,,200,1.676631,49.069903
2020-1135496,2020-03-09,000001,Vente,20092,,,LES PLAINES,B068,78840,78410,Moisson,78,,,784100000F0040,,,,,,,,,,,,,0,,,,,L,landes,,,230,1.648356,49.077391
2020-1135496,2020-03-09,000001,Vente,20092,,,ILE DE HAUTE ISLE,B045,78840,78410,Moisson,78,,,784100000G0169,,,,,,,,,,,,,0,,,,,L,landes,,,50,1.667103,49.077373
2020-1135496,2020-03-09,000001,Vente,20092,,,ILE DE HAUTE ISLE,B045,78840,78410,Moisson,78,,,784100000G0172,,,,,,,,,,,,,0,,,,,L,landes,,,275,1.667088,49.077052
2020-1135496,2020-03-09,000001,Vente,20092,,,ILE DE HAUTE ISLE,B045,78840,78410,Moisson,78,,,784100000G0181,,,,,,,,,,,,,0,,,,,L,landes,,,49,1.667606,49.077358
2020-1135567,2020-03-11,000001,Vente,280000,16,,PROM DES ROCHES,0870,78840,78410,Moisson,78,,,78410000AA0022,,,,,,,,,,,,,0,1,Maison,120,4,S,sols,,,500,1.666035,49.075755
2020-1135567,2020-03-11,000001,Vente,280000,16,,PROM DES ROCHES,0870,78840,78410,Moisson,78,,,78410000AA0022,,,,,,,,,,,,,0,1,Maison,120,4,AG,terrains d'agrément,JARD,Jardin d'agrément,723,1.666035,49.075755
2020-1135668,2020-03-21,000001,Vente,174000,,,RUE DES MARES,0660,78840,78410,Moisson,78,,,78410000AB0117,,,,,,,,,,,,,0,,,,,J,jardins,POTAG,Jardin potager,577,1.670712,49.073476
2020-1135668,2020-03-21,000001,Vente,174000,31,,RTE DE LAVACOURT,0600,78840,78410,Moisson,78,,,78410000AB0118,,,,,,,,,,,,,0,1,Maison,102,3,S,sols,,,272,1.670476,49.073121
2020-1135681,2020-04-10,000001,Vente,500000,27,,RTE DE LA ROCHE GUYON,0900,78840,78410,Moisson,78,,,78410000AA0129,,,,,,,,,,,,,0,4,Local industriel. commercial ou assimilé,64,0,AG,terrains d'agrément,JARD,Jardin d'agrément,2941,1.663878,49.073061
2020-1135681,2020-04-10,000001,Vente,500000,27,,RTE DE LA ROCHE GUYON,0900,78840,78410,Moisson,78,,,78410000AA0129,,,,,,,,,,,,,0,1,Maison,216,7,S,sols,,,1000,1.663878,49.073061
2020-1135681,2020-04-10,000001,Vente,500000,27,,RTE DE LA ROCHE GUYON,0900,78840,78410,Moisson,78,,,78410000AA0129,,,,,,,,,,,,,0,3,Dépendance,,0,S,sols,,,1000,1.663878,49.073061
2020-1135681,2020-04-10,000001,Vente,500000,27,,RTE DE LA ROCHE GUYON,0900,78840,78410,Moisson,78,,,78410000AA0129,,,,,,,,,,,,,0,4,Local industriel. commercial ou assimilé,64,0,S,sols,,,1000,1.663878,49.073061
2020-1135681,2020-04-10,000001,Vente,500000,27,,RTE DE LA ROCHE GUYON,0900,78840,78410,Moisson,78,,,78410000AA0129,,,,,,,,,,,,,0,1,Maison,216,7,AG,terrains d'agrément,JARD,Jardin d'agrément,2941,1.663878,49.073061
2020-1135681,2020-04-10,000001,Vente,500000,27,,RTE DE LA ROCHE GUYON,0900,78840,78410,Moisson,78,,,78410000AA0129,,,,,,,,,,,,,0,3,Dépendance,,0,AG,terrains d'agrément,JARD,Jardin d'agrément,2941,1.663878,49.073061
2020-1135681,2020-04-10,000001,Vente,500000,27,,RTE DE LA ROCHE GUYON,0900,78840,78410,Moisson,78,,,78410000AA0130,,,,,,,,,,,,,0,,,,,AG,terrains d'agrément,JARD,Jardin d'agrément,4040,1.664258,49.073957
2020-1135713,2020-04-22,000001,Vente,210000,,,LAVACOURT NORD,B054,78840,78410,Moisson,78,,,784100000D0207,,,,,,,,,,,,,0,,,,,J,jardins,POTAG,Jardin potager,1345,1.693179,49.064394
2020-1135713,2020-04-22,000001,Vente,210000,2,,PROM CLAUDE MONET,0330,78840,78410,Moisson,78,,,784100000D0209,,,,,,,,,,,,,0,1,Maison,108,4,S,sols,,,330,1.693394,49.064191
2020-1135728,2020-04-30,000001,Vente,120000,4,,CHE DES BARRIERES,0180,78840,78410,Moisson,78,,,78410000AB0164,,,,,,,,,,,,,0,1,Maison,94,5,S,sols,,,373,1.667667,49.071798
2020-1135728,2020-04-30,000001,Vente,120000,,,CHE DES BARRIERES,0180,78840,78410,Moisson,78,,,78410000AB0165,,,,,,,,,,,,,0,,,,,J,jardins,POTAG,Jardin potager,340,1.667822,49.071803
2020-1135933,2020-05-19,000001,Vente,251550,63,B,RTE DE LAVACOURT,0600,78840,78410,Moisson,78,,,784100000C1127,,,,,,,,,,,,,0,1,Maison,165,6,AB,terrains a bâtir,,,1069,1.679097,49.070716
2020-1135936,2020-05-23,000001,Vente,100000,,,LAVACOURT SUD,B055,78840,78410,Moisson,78,,,784100000D0464,,,,,,,,,,,,,0,,,,,J,jardins,POTAG,Jardin potager,275,1.693918,49.062306
2020-1135936,2020-05-23,000001,Vente,100000,,,LAVACOURT SUD,B055,78840,78410,Moisson,78,,,784100000D0465,,,,,,,,,,,,,0,,,,,J,jardins,POTAG,Jardin potager,208,1.693647,49.062306
2020-1135936,2020-05-23,000001,Vente,100000,5101,,PAS DU PORT,0810,78840,78410,Moisson,78,,,784100000D0466,,,,,,,,,,,,,0,3,Dépendance,,0,AB,terrains a bâtir,,,207,1.693392,49.062333
2020-1136270,2020-07-01,000002,Vente,15000,,,LES GRAVIERS,B030,78840,78410,Moisson,78,,,784100000A1294,,,,,,,,,,,,,0,,,,,T,terres,,,296,1.652838,49.077979
2020-1136270,2020-07-01,000002,Vente,15000,49,,PROM DES ROCHES,0870,78840,78410,Moisson,78,,,784100000A1296,,,,,,,,,,,,,0,1,Maison,16,1,S,sols,,,222,1.652954,49.077962
2020-1136270,2020-07-01,000002,Vente,15000,49,,PROM DES ROCHES,0870,78840,78410,Moisson,78,,,784100000A1296,,,,,,,,,,,,,0,1,Maison,24,1,S,sols,,,222,1.652954,49.077962
2020-1136425,2020-07-17,000001,Vente,258000,2,,ALL DU JAMBOREE,0540,78840,78410,Moisson,78,,,78410000AA0199,,,,,,,,,,,,,0,1,Maison,140,5,S,sols,,,519,1.666699,49.072725
2020-1136425,2020-07-17,000001,Vente,258000,,,ALL DU JAMBOREE,0540,78840,78410,Moisson,78,,,78410000AA0201,,,,,,,,,,,,,0,,,,,S,sols,,,126,1.66654,49.072805
2020-1136485,2020-07-29,000001,Vente,91727,,,ILE ROBIN,B051,78840,78410,Moisson,78,,,784100000G0306,,,,,,,,,,,,,0,,,,,L,landes,,,264,1.692632,49.067414
2020-1136485,2020-07-29,000001,Vente,91727,,,ILE ROBIN,B051,78840,78410,Moisson,78,,,784100000G0308,,,,,,,,,,,,,0,,,,,L,landes,,,189,1.692338,49.067532
2020-1136485,2020-07-29,000001,Vente,91727,,,ILE ROBIN,B051,78840,78410,Moisson,78,,,784100000G0316,,,,,,,,,,,,,0,,,,,L,landes,,,385,1.690921,49.068223
2020-1136485,2020-07-29,000001,Vente,91727,,,ILE ROBIN,B051,78840,78410,Moisson,78,,,784100000G0318,,,,,,,,,,,,,0,,,,,L,landes,,,178,1.690587,49.068417
2020-1136485,2020-07-29,000001,Vente,91727,,,ILE DE BOUCHE,B043,78840,78410,Moisson,78,,,784100000G0321,,,,,,,,,,,,,0,,,,,T,terres,,,41052,1.687698,49.070507
2020-1136485,2020-07-29,000001,Vente,91727,,,ILE DE BOUCHE,B043,78840,78410,Moisson,78,,,784100000G0322,,,,,,,,,,,,,0,,,,,T,terres,,,7737,1.684245,49.072483
2020-1136485,2020-07-29,000001,Vente,91727,,,ILE DE BOUCHE,B043,78840,78410,Moisson,78,,,784100000G0323,,,,,,,,,,,,,0,,,,,T,terres,,,611,1.683676,49.072812
2020-1136485,2020-07-29,000001,Vente,91727,,,ILE DE BOUCHE,B043,78840,78410,Moisson,78,,,784100000G0324,,,,,,,,,,,,,0,,,,,T,terres,,,23080,1.681019,49.073927
2020-1136647,2020-08-06,000001,Vente,190000,6,T,CHE DU BOIS BEAUCERON,0210,78840,78410,Moisson,78,,,78410000AB0222,,,,,,,,,,,,,0,1,Maison,68,3,S,sols,,,405,1.669343,49.072756
2020-1136714,2020-08-14,000001,Vente,296160,51,,RTE DE LA ROCHE GUYON,0900,78840,78410,Moisson,78,,,78410000AA0093,,,,,,,,,,,,,0,1,Maison,133,4,S,sols,,,500,1.659485,49.074246
2020-1136714,2020-08-14,000001,Vente,296160,51,,RTE DE LA ROCHE GUYON,0900,78840,78410,Moisson,78,,,78410000AA0093,,,,,,,,,,,,,0,1,Maison,133,4,AG,terrains d'agrément,JARD,Jardin d'agrément,491,1.659485,49.074246
2020-1136783,2020-08-28,000002,Vente,10000,12,,RTE DE LA BALLONNIERE,0120,78840,78410,Moisson,78,,,78410000AA0250,,,,,,,,,,,,,0,,,,,S,sols,,,21,1.667126,49.07292
2020-1136920,2020-09-04,000001,Vente,249000,56,,PROM CLAUDE MONET,0330,78840,78410,Moisson,78,,,784100000D0917,,,,,,,,,,,,,0,1,Maison,67,4,S,sols,,,83,1.694156,49.059479
2020-1136920,2020-09-04,000001,Vente,249000,,,LES FLOTS,B025,78840,78410,Moisson,78,,,784100000D0918,,,,,,,,,,,,,0,,,,,J,jardins,POTAG,Jardin potager,2557,1.693836,49.059528
2020-1137096,2020-09-17,000001,Vente,4000,,,LES GRAVIERS,B030,78840,78410,Moisson,78,,,78410000AA0018,,,,,,,,,,,,,0,,,,,T,terres,,,340,1.664886,49.075973
2020-1137215,2020-10-09,000001,Vente,260000,12,,CHE DU BOIS BEAUCERON,0210,78840,78410,Moisson,78,,,78410000AB0154,,,,,,,,,,,,,0,1,Maison,123,4,AG,terrains d'agrément,JARD,Jardin d'agrément,851,1.669839,49.070733
2020-1137215,2020-10-09,000001,Vente,260000,12,,CHE DU BOIS BEAUCERON,0210,78840,78410,Moisson,78,,,78410000AB0154,,,,,,,,,,,,,0,1,Maison,123,4,S,sols,,,500,1.669839,49.070733
2020-1137571,2020-10-24,000001,Vente,84000,36,,RTE DE LA ROCHE GUYON,0900,78840,78410,Moisson,78,,,78410000AA0058,,,,,,,,,,,,,0,1,Maison,64,2,AG,terrains d'agrément,JARD,Jardin d'agrément,717,1.664192,49.074683
2020-1137571,2020-10-24,000001,Vente,84000,36,,RTE DE LA ROCHE GUYON,0900,78840,78410,Moisson,78,,,78410000AA0058,,,,,,,,,,,,,0,1,Maison,64,2,S,sols,,,500,1.664192,49.074683
2020-1137906,2020-12-09,000001,Vente,2050000,,,LA VACHERIE,B076,78840,78410,Moisson,78,,,784100000F0003,,,,,,,,,,,,,0,,,,,P,prés,,,23180,1.631489,49.077604
2020-1137906,2020-12-09,000001,Vente,2050000,5007,,LA VACHERIE,B076,78840,78410,Moisson,78,,,784100000F0272,,,,,,,,,,,,,0,1,Maison,60,3,S,sols,,,500,1.631001,49.077655
2020-1137906,2020-12-09,000001,Vente,2050000,5007,,LA VACHERIE,B076,78840,78410,Moisson,78,,,784100000F0272,,,,,,,,,,,,,0,1,Maison,255,7,AG,terrains d'agrément,JARD,Jardin d'agrément,3426,1.631001,49.077655
2020-1137906,2020-12-09,000001,Vente,2050000,5007,,LA VACHERIE,B076,78840,78410,Moisson,78,,,784100000F0272,,,,,,,,,,,,,0,1,Maison,60,3,AG,terrains d'agrément,JARD,Jardin d'agrément,3426,1.631001,49.077655
2020-1137906,2020-12-09,000001,Vente,2050000,5007,,LA VACHERIE,B076,78840,78410,Moisson,78,,,784100000F0272,,,,,,,,,,,,,0,1,Maison,255,7,S,sols,,,500,1.631001,49.077655
