id_mutation,date_mutation,numero_disposition,nature_mutation,valeur_fonciere,adresse_numero,adresse_suffixe,adresse_nom_voie,adresse_code_voie,code_postal,code_commune,nom_commune,code_departement,ancien_code_commune,ancien_nom_commune,id_parcelle,ancien_id_parcelle,numero_volume,lot1_numero,lot1_surface_carrez,lot2_numero,lot2_surface_carrez,lot3_numero,lot3_surface_carrez,lot4_numero,lot4_surface_carrez,lot5_numero,lot5_surface_carrez,nombre_lots,code_type_local,type_local,surface_reelle_bati,nombre_pieces_principales,code_nature_culture,nature_culture,code_nature_culture_speciale,nature_culture_speciale,surface_terrain,longitude,latitude
2020-1159055,2020-01-28,000001,Vente,115000,,,RTE DE PARIS,0200,80580,80268,Épagne-Épagnette,80,,,802680000C0392,,,,,,,,,,,,,0,,,,,AB,terrains a bâtir,,,555,1.854923,50.079112
2020-1159055,2020-01-28,000001,Vente,115000,,,RTE DE PARIS,0200,80580,80268,Épagne-Épagnette,80,,,802680000C0394,,,,,,,,,,,,,0,,,,,L,landes,,,30,1.854767,50.079006
2020-1159055,2020-01-28,000001,Vente,115000,76,,RTE DE PARIS,0200,80580,80268,Épagne-Épagnette,80,,,802680000C0395,,,,,,,,,,,,,0,,,,,S,sols,,,500,1.855408,50.079495
2020-1159055,2020-01-28,000001,Vente,115000,76,,RTE DE PARIS,0200,80580,80268,Épagne-Épagnette,80,,,802680000C0395,,,,,,,,,,,,,0,,,,,J,jardins,,,542,1.855408,50.079495
2020-1159055,2020-01-28,000001,Vente,115000,76,,RTE DE PARIS,0200,80580,80268,Épagne-Épagnette,80,,,802680000C0398,,,,,,,,,,,,,0,,,,,AB,terrains a bâtir,,,565,1.855037,50.07922
2020-1159100,2020-01-10,000001,Vente,147000,67,,RTE DE PARIS,0200,80580,80268,Épagne-Épagnette,80,,,802680000B0330,,,,,,,,,,,,,0,1,Maison,76,4,S,sols,,,780,1.869709,50.073213
2020-1159100,2020-01-10,000001,Vente,147000,67,,RTE DE PARIS,0200,80580,80268,Épagne-Épagnette,80,,,802680000B0330,,,,,,,,,,,,,0,1,Maison,76,4,J,jardins,,,329,1.869709,50.073213
2020-1159100,2020-01-10,000001,Vente,147000,,,LE VILLAGE,B022,80580,80268,Épagne-Épagnette,80,,,802680000B0333,,,,,,,,,,,,,0,,,,,J,jardins,,,150,1.869933,50.073459
2020-1159249,2020-02-13,000001,Vente,70000,,,LE VILLAGE,B022,80580,80268,Épagne-Épagnette,80,,,802680000B0060,,,,,,,,,,,,,0,,,,,S,sols,,,18,1.873172,50.071921
2020-1159249,2020-02-13,000001,Vente,70000,,,LE VILLAGE,B022,80580,80268,Épagne-Épagnette,80,,,802680000B0060,,,,,,,,,,,,,0,,,,,J,jardins,,,1697,1.873172,50.071921
2020-1159249,2020-02-13,000001,Vente,70000,47,,RTE DE PARIS,0200,80580,80268,Épagne-Épagnette,80,,,802680000B0061,,,,,,,,,,,,,0,1,Maison,88,4,S,sols,,,303,1.87293,50.071661
2020-1160311,2020-06-18,000002,Vente,,,,TERRES DE VAUCHELLES,B018,80580,80268,Épagne-Épagnette,80,,,80268000ZE0057,,,,,,,,,,,,,0,,,,,T,terres,,,850,1.878798,50.091307
2020-1160311,2020-06-18,000002,Vente,,,,TERRES DE VAUCHELLES,B018,80580,80268,Épagne-Épagnette,80,,,80268000ZE0062,,,,,,,,,,,,,0,,,,,T,terres,,,8659,1.876763,50.091041
2020-1160311,2020-06-18,000002,Vente,,,,LES VINGT QUATRE,B023,80580,80268,Épagne-Épagnette,80,,,80268000ZE0067,,,,,,,,,,,,,0,,,,,L,landes,,,219,1.879404,50.086593
2020-1160311,2020-06-18,000002,Vente,,,,TERRES DE VAUCHELLES,B018,80580,80268,Épagne-Épagnette,80,,,80268000ZE0069,,,,,,,,,,,,,0,,,,,T,terres,,,3053,1.885899,50.08339
2020-1160311,2020-06-18,000002,Vente,,,,TERRES DE VAUCHELLES,B018,80580,80268,Épagne-Épagnette,80,,,80268000ZE0071,,,,,,,,,,,,,0,,,,,T,terres,,,2379,1.888304,50.084752
2020-1161421,2020-09-30,000001,Vente,249000,3,T,CHE DU MOULIN,0100,80580,80268,Épagne-Épagnette,80,,,80268000ZD0031,,,,,,,,,,,,,0,1,Maison,175,6,S,sols,,,1277,1.879058,50.07053
2020-1161421,2020-09-30,000001,Vente,249000,3,T,CHE DU MOULIN,0100,80580,80268,Épagne-Épagnette,80,,,80268000ZD0031,,,,,,,,,,,,,0,1,Maison,175,6,T,terres,,,1082,1.879058,50.07053
2020-1161657,2020-10-09,000001,Vente,106000,,,EPAGNETTE,B008,80580,80268,Épagne-Épagnette,80,,,802680000C0045,,,,,,,,,,,,,0,,,,,J,jardins,,,855,1.850467,50.081626
2020-1161657,2020-10-09,000001,Vente,106000,92,,RTE DE PARIS,0200,80580,80268,Épagne-Épagnette,80,,,802680000C0046,,,,,,,,,,,,,0,1,Maison,90,5,S,sols,,,415,1.851002,50.081923
2020-1161991,2020-11-19,000001,Vente,38000,77,,RTE DE PARIS,0200,80580,80268,Épagne-Épagnette,80,,,802680000B0024,,,,,,,,,,,,,0,1,Maison,38,1,S,sols,,,403,1.868279,50.07375
2020-1162133,2020-11-25,000001,Vente,40000,,,LE VILLAGE,B022,80580,80268,Épagne-Épagnette,80,,,802680000B0181,,,,,,,,,,,,,0,,,,,BP,peupleraies,,,3965,1.87288,50.068684
2020-1162133,2020-11-25,000001,Vente,40000,,,LE VILLAGE,B022,80580,80268,Épagne-Épagnette,80,,,802680000B0182,,,,,,,,,,,,,0,,,,,BP,peupleraies,,,1798,1.872454,50.0685
2020-1162133,2020-11-25,000001,Vente,40000,,,L ABBAYE,B001,80580,80268,Épagne-Épagnette,80,,,802680000B0431,,,,,,,,,,,,,0,,,,,BP,peupleraies,,,45780,1.875361,50.068001
2020-1162214,2020-12-18,000001,Vente,343000,57,,RTE DE PARIS,0200,80580,80268,Épagne-Épagnette,80,,,802680000B0387,,,,,,,,,,,,,0,1,Maison,166,6,S,sols,,,1038,1.871514,50.072451
2020-1162214,2020-12-18,000001,Vente,343000,,,RUE DU TOUR DU BOIS,0300,80580,80268,Épagne-Épagnette,80,,,802680000B0395,,,,,,,,,,,,,0,,,,,BS,taillis sous futaie,,,479,1.871606,50.07256
2020-1162317,2020-12-16,000001,Vente,28000,,,LES PRES,B013,80580,80268,Épagne-Épagnette,80,,,802680000B0408,,,,,,,,,,,,,0,,,,,AG,terrains d'agrément,,,1906,1.858065,50.071246
2020-1162317,2020-12-16,000001,Vente,28000,,,LES PRES,B013,80580,80268,Épagne-Épagnette,80,,,802680000B0408,,,,,,,,,,,,,0,,,,,L,landes,,,3957,1.858065,50.071246
2020-1162452,2020-12-14,000001,Vente,200000,6,,RTE DE PARIS,0200,80580,80268,Épagne-Épagnette,80,,,80268000ZD0015,,,,,,,,,,,,,0,1,Maison,117,5,T,terres,,,5560,1.876306,50.06929
