id_mutation,date_mutation,numero_disposition,nature_mutation,valeur_fonciere,adresse_numero,adresse_suffixe,adresse_nom_voie,adresse_code_voie,code_postal,code_commune,nom_commune,code_departement,ancien_code_commune,ancien_nom_commune,id_parcelle,ancien_id_parcelle,numero_volume,lot1_numero,lot1_surface_carrez,lot2_numero,lot2_surface_carrez,lot3_numero,lot3_surface_carrez,lot4_numero,lot4_surface_carrez,lot5_numero,lot5_surface_carrez,nombre_lots,code_type_local,type_local,surface_reelle_bati,nombre_pieces_principales,code_nature_culture,nature_culture,code_nature_culture_speciale,nature_culture_speciale,surface_terrain,longitude,latitude
2020-1158893,2020-07-07,000001,Adjudication,31000,1,B,RUE DU MOULIN WABLE,0220,80700,80359,Fresnoy-lès-Roye,80,,,80359000AB0191,,,,,,,,,,,,,0,1,Maison,65,3,S,sols,,,104,2.777217,49.738693
2020-1158893,2020-07-07,000001,Adjudication,31000,1,B,RUE DU MOULIN WABLE,0220,80700,80359,Fresnoy-lès-Roye,80,,,80359000AB0191,,,,,,,,,,,,,0,1,Maison,65,3,J,jardins,,,643,2.777217,49.738693
2020-1162885,2020-03-07,000001,Vente,40000,6,,RUE VILLAIN,0260,80700,80359,Fresnoy-lès-Roye,80,,,80359000AC0072,,,,,,,,,,,,,0,1,Maison,175,7,J,jardins,,,982,2.779633,49.736355
2020-1162885,2020-03-07,000001,Vente,40000,6,,RUE VILLAIN,0260,80700,80359,Fresnoy-lès-Roye,80,,,80359000AC0072,,,,,,,,,,,,,0,1,Maison,175,7,S,sols,,,241,2.779633,49.736355
2020-1163158,2020-07-16,000001,Vente,678000,5106,,RUE D EN BAS,0020,80700,80359,Fresnoy-lès-Roye,80,,,80359000AC0198,,,,,,,,,,,,,0,4,Local industriel. commercial ou assimilé,1000,0,S,sols,,,1014,2.77576,49.733296
2020-1163158,2020-07-16,000001,Vente,678000,,,LE VILLAGE,B017,80700,80359,Fresnoy-lès-Roye,80,,,80359000AC0207,,,,,,,,,,,,,0,,,,,S,sols,,,280,2.776615,49.733596
2020-1163158,2020-07-16,000001,Vente,678000,,,LE VILLAGE,B017,80700,80359,Fresnoy-lès-Roye,80,,,80359000AC0255,,,,,,,,,,,,,0,,,,,S,sols,,,31,2.775566,49.733421
2020-1163158,2020-07-16,000001,Vente,678000,,,PETITE SOLE,B011,80700,80359,Fresnoy-lès-Roye,80,,,80359000ZE0035,,,,,,,,,,,,,0,,,,,T,terres,,,86,2.77586,49.732986
2020-1163158,2020-07-16,000001,Vente,678000,3,,RUE D EN BAS,0020,80700,80359,Fresnoy-lès-Roye,80,,,80359000ZE0068,,,,,,,,,,,,,0,4,Local industriel. commercial ou assimilé,2940,0,S,sols,,,6517,2.777825,49.733695
2020-1163158,2020-07-16,000001,Vente,678000,5107,,RUE D EN BAS,0020,80700,80359,Fresnoy-lès-Roye,80,,,80359000ZE0076,,,,,,,,,,,,,0,4,Local industriel. commercial ou assimilé,2300,0,S,sols,,,11413,2.777007,49.733863
2020-1163158,2020-07-16,000001,Vente,678000,5107,,RUE D EN BAS,0020,80700,80359,Fresnoy-lès-Roye,80,,,80359000ZE0076,,,,,,,,,,,,,0,4,Local industriel. commercial ou assimilé,2321,0,S,sols,,,11413,2.777007,49.733863
2020-1163158,2020-07-16,000001,Vente,678000,5107,,RUE D EN BAS,0020,80700,80359,Fresnoy-lès-Roye,80,,,80359000ZE0077,,,,,,,,,,,,,0,,,,,S,sols,,,1025,2.77784,49.733134
2020-1163204,2020-07-31,000001,Vente,55000,9,,RUE DE LIHONS,0200,80700,80359,Fresnoy-lès-Roye,80,,,80359000AB0031,,,,,,,,,,,,,0,1,Maison,37,2,S,sols,,,267,,
2020-1163204,2020-07-31,000001,Vente,55000,9,,RUE DE LIHONS,0200,80700,80359,Fresnoy-lès-Roye,80,,,80359000AB0031,,,,,,,,,,,,,0,1,Maison,37,2,J,jardins,,,1005,,
2020-1163204,2020-07-31,000001,Vente,55000,12,,RUE DE LIHONS,0200,80700,80359,Fresnoy-lès-Roye,80,,,80359000AB0048,,,,,,,,,,,,,0,1,Maison,42,2,S,sols,,,694,2.775376,49.739571
2020-1163204,2020-07-31,000001,Vente,55000,,,LE VILLAGE,B017,80700,80359,Fresnoy-lès-Roye,80,,,80359000AB0119,,,,,,,,,,,,,0,,,,,P,prés,,,1305,,
2020-1163204,2020-07-31,000001,Vente,55000,4,,RUE DU MOULIN WABLE,0220,80700,80359,Fresnoy-lès-Roye,80,,,80359000AB0140,,,,,,,,,,,,,0,1,Maison,78,1,J,jardins,,,750,,
2020-1163204,2020-07-31,000001,Vente,55000,4,,RUE DU MOULIN WABLE,0220,80700,80359,Fresnoy-lès-Roye,80,,,80359000AB0140,,,,,,,,,,,,,0,1,Maison,78,1,S,sols,,,812,,
2020-1163245,2020-07-30,000002,Vente,22000,,,LE VILLAGE,B017,80700,80359,Fresnoy-lès-Roye,80,,,80359000AB0059,,,,,,,,,,,,,0,,,,,P,prés,,,630,2.774874,49.742308
2020-1163245,2020-07-30,000002,Vente,22000,26,,RUE DE LIHONS,0200,80700,80359,Fresnoy-lès-Roye,80,,,80359000AB0209,,,,,,,,,,,,,0,,,,,P,prés,,,559,2.77536,49.742206
2020-1163245,2020-07-30,000002,Vente,22000,26,,RUE DE LIHONS,0200,80700,80359,Fresnoy-lès-Roye,80,,,80359000AB0239,,,,,,,,,,,,,0,,,,,P,prés,,,273,2.775603,49.742153
2020-1163245,2020-07-30,000002,Vente,22000,,,LE VILLAGE,B017,80700,80359,Fresnoy-lès-Roye,80,,,80359000AB0241,,,,,,,,,,,,,0,,,,,P,prés,,,437,2.775855,49.742134
2020-1163246,2020-07-30,000001,Vente,3000,26,,RUE DE LIHONS,0200,80700,80359,Fresnoy-lès-Roye,80,,,80359000AB0240,,,,,,,,,,,,,0,,,,,P,prés,,,764,2.775759,49.741964
2020-1163246,2020-07-30,000001,Vente,3000,,,LE VILLAGE,B017,80700,80359,Fresnoy-lès-Roye,80,,,80359000AB0242,,,,,,,,,,,,,0,,,,,P,prés,,,78,2.776054,49.742057
2020-1163410,2020-09-30,000001,Vente,20000,,,LE VILLAGE,B017,80700,80359,Fresnoy-lès-Roye,80,,,80359000AB0119,,,,,,,,,,,,,0,,,,,P,prés,,,1305,,
2020-1163410,2020-09-30,000001,Vente,20000,4,,RUE DU MOULIN WABLE,0220,80700,80359,Fresnoy-lès-Roye,80,,,80359000AB0140,,,,,,,,,,,,,0,1,Maison,78,1,S,sols,,,812,,
2020-1163410,2020-09-30,000001,Vente,20000,4,,RUE DU MOULIN WABLE,0220,80700,80359,Fresnoy-lès-Roye,80,,,80359000AB0140,,,,,,,,,,,,,0,1,Maison,78,1,J,jardins,,,750,,
