id_mutation,date_mutation,numero_disposition,nature_mutation,valeur_fonciere,adresse_numero,adresse_suffixe,adresse_nom_voie,adresse_code_voie,code_postal,code_commune,nom_commune,code_departement,ancien_code_commune,ancien_nom_commune,id_parcelle,ancien_id_parcelle,numero_volume,lot1_numero,lot1_surface_carrez,lot2_numero,lot2_surface_carrez,lot3_numero,lot3_surface_carrez,lot4_numero,lot4_surface_carrez,lot5_numero,lot5_surface_carrez,nombre_lots,code_type_local,type_local,surface_reelle_bati,nombre_pieces_principales,code_nature_culture,nature_culture,code_nature_culture_speciale,nature_culture_speciale,surface_terrain,longitude,latitude
2020-1159843,2020-05-25,000001,Vente,2105,,,LE CHEMIN D ARQUEVES,B012,80600,80659,Raincheval,80,,,80659000ZC0045,,,,,,,,,,,,,0,,,,,T,terres,,,3190,2.452968,50.078997
2020-1160799,2020-07-02,000001,Vente,1980,,,LE COURTIZEUX,B018,80600,80659,Raincheval,80,,,80659000ZC0077,,,,,,,,,,,,,0,,,,,P,prés,,,1320,2.442256,50.076041
2020-1161569,2020-10-19,000002,Vente,66000,,,LE VILLAGE,B048,80600,80659,Raincheval,80,,,806590000D0498,,,,,,,,,,,,,0,,,,,P,prés,,,1114,2.439195,50.07189
2020-1161569,2020-10-19,000002,Vente,66000,,,LE VILLAGE,B048,80600,80659,Raincheval,80,,,806590000D0499,,,,,,,,,,,,,0,,,,,P,prés,,,66,2.439226,50.072105
2020-1161569,2020-10-19,000002,Vente,66000,,,LE VILLAGE,B048,80600,80659,Raincheval,80,,,806590000D0500,,,,,,,,,,,,,0,,,,,P,prés,,,49,2.43897,50.072017
2020-1161569,2020-10-19,000002,Vente,66000,,,LE VILLAGE,B048,80600,80659,Raincheval,80,,,806590000D0501,,,,,,,,,,,,,0,,,,,P,prés,,,769,2.438993,50.072141
2020-1161741,2020-11-13,000001,Vente,290000,,,RUE PRINCIPALE,0053,80600,80659,Raincheval,80,,,806590000D0414,,,,,,,,,,,,,0,,,,,S,sols,,,59,2.438267,50.074497
2020-1161741,2020-11-13,000001,Vente,290000,12,,RUE PRINCIPALE,0053,80600,80659,Raincheval,80,,,806590000D0423,,,,,,,,,,,,,0,1,Maison,299,8,S,sols,,,2135,2.438127,50.074451
2020-1161843,2020-11-12,000001,Vente,127450,13,B,RUE DU PONT,0012,80600,80659,Raincheval,80,,,806590000D0475,,,,,,,,,,,,,0,1,Maison,80,3,S,sols,,,287,2.438737,50.071307
2020-1161848,2020-11-24,000001,Vente,2353,,,LE COURTIZEUX,B018,80600,80659,Raincheval,80,,,80659000ZC0073,,,,,,,,,,,,,0,,,,,T,terres,,,3460,2.446458,50.076935
2020-1161853,2020-11-19,000001,Vente,65000,,,LE VILLAGE,B048,80600,80659,Raincheval,80,,,806590000D0083,,,,,,,,,,,,,0,,,,,P,prés,,,450,2.438437,50.073102
2020-1161853,2020-11-19,000001,Vente,65000,15,,RUE DE HAUT,0025,80600,80659,Raincheval,80,,,806590000D0085,,,,,,,,,,,,,0,1,Maison,37,1,S,sols,,,1340,2.43834,50.07352
2020-1161853,2020-11-19,000001,Vente,65000,15,,RUE DE HAUT,0025,80600,80659,Raincheval,80,,,806590000D0085,,,,,,,,,,,,,0,1,Maison,34,2,S,sols,,,1340,2.43834,50.07352
