id_mutation,date_mutation,numero_disposition,nature_mutation,valeur_fonciere,adresse_numero,adresse_suffixe,adresse_nom_voie,adresse_code_voie,code_postal,code_commune,nom_commune,code_departement,ancien_code_commune,ancien_nom_commune,id_parcelle,ancien_id_parcelle,numero_volume,lot1_numero,lot1_surface_carrez,lot2_numero,lot2_surface_carrez,lot3_numero,lot3_surface_carrez,lot4_numero,lot4_surface_carrez,lot5_numero,lot5_surface_carrez,nombre_lots,code_type_local,type_local,surface_reelle_bati,nombre_pieces_principales,code_nature_culture,nature_culture,code_nature_culture_speciale,nature_culture_speciale,surface_terrain,longitude,latitude
2020-1158933,2020-01-07,000001,Vente,547500,208,,RUE ANGUIER DU PEUPLE,0040,80230,80721,Saint-Valery-sur-Somme,80,,,80721000AI0259,,,,,,,,,,,,,0,1,Maison,149,5,S,sols,,,379,1.64326,50.180743
2020-1158937,2020-01-06,000001,Vente en l'état futur d'achèvement,181000,,,LE CHANTIER,B015,80230,80721,Saint-Valery-sur-Somme,80,,,80721000AI0386,,,420,,,,,,,,,,1,3,Dépendance,,0,,,,,,1.642231,50.178879
2020-1158937,2020-01-06,000001,Vente en l'état futur d'achèvement,181000,,,LE CHANTIER,B015,80230,80721,Saint-Valery-sur-Somme,80,,,80721000AI0386,,,101,,,,,,,,,,1,2,Appartement,51,2,,,,,,1.642231,50.178879
2020-1158941,2020-01-03,000001,Vente,390000,53,,RUE CAVEE LEVEQUE,0520,80230,80721,Saint-Valery-sur-Somme,80,,,80721000AL0008,,,,,,,,,,,,,0,1,Maison,45,3,S,sols,,,628,1.642474,50.176908
2020-1158941,2020-01-03,000001,Vente,390000,53,,RUE CAVEE LEVEQUE,0520,80230,80721,Saint-Valery-sur-Somme,80,,,80721000AL0008,,,,,,,,,,,,,0,1,Maison,155,5,S,sols,,,628,1.642474,50.176908
2020-1158941,2020-01-03,000001,Vente,390000,,,LE SOLEIL LEVANT NORD,B077,80230,80721,Saint-Valery-sur-Somme,80,,,80721000AL0666,,,,,,,,,,,,,0,,,,,S,sols,,,116,1.642483,50.176706
2020-1158948,2020-01-15,000001,Vente,11412.8,,,AUX REMISES,B063,80230,80721,Saint-Valery-sur-Somme,80,,,80721000AS0128,,,,,,,,,,,,,0,,,,,T,terres,,,4018,1.605544,50.166337
2020-1158948,2020-01-15,000001,Vente,11412.8,,,A LA MIZENNE,B049,80230,80721,Saint-Valery-sur-Somme,80,,,80721000AV0023,,,,,,,,,,,,,0,,,,,T,terres,,,6055,1.600429,50.177465
2020-1158948,2020-01-15,000001,Vente,11412.8,,,TERROIR DU CAP HORNU,B079,80230,80721,Saint-Valery-sur-Somme,80,,,80721000AW0072,,,,,,,,,,,,,0,,,,,T,terres,,,18459,1.608687,50.184221
2020-1158967,2020-01-13,000001,Vente,475000,287,,RUE JULES GAFFE,0480,80230,80721,Saint-Valery-sur-Somme,80,,,80721000AH0649,,,,,,,,,,,,,0,1,Maison,166,5,S,sols,,,500,1.634854,50.184694
2020-1158967,2020-01-13,000001,Vente,475000,287,,RUE JULES GAFFE,0480,80230,80721,Saint-Valery-sur-Somme,80,,,80721000AH0649,,,,,,,,,,,,,0,1,Maison,166,5,AG,terrains d'agrément,,,694,1.634854,50.184694
2020-1158979,2020-01-20,000001,Vente,150000,1,,RUE BRANDT,0110,80230,80721,Saint-Valery-sur-Somme,80,,,80721000AB0171,,,,,,,,,,,,,0,1,Maison,96,4,S,sols,,,988,1.628294,50.187285
2020-1158998,2020-01-15,000001,Vente,145000,201,,RUE DU CHANTIER,0160,80230,80721,Saint-Valery-sur-Somme,80,,,80721000AI0350,,,,,,,,,,,,,0,1,Maison,61,2,S,sols,,,78,1.643829,50.178891
2020-1159008,2020-01-22,000001,Vente,243800,,,RUE DE LA CROIX L ABBE,0230,80230,80721,Saint-Valery-sur-Somme,80,,,80721000AH0357,,,,,,,,,,,,,0,,,,,J,jardins,,,408,1.629214,50.186036
2020-1159008,2020-01-22,000001,Vente,243800,31,,RUE DU DOCTEUR LEGER,0250,80230,80721,Saint-Valery-sur-Somme,80,,,80721000AH0364,,,,,,,,,,,,,0,1,Maison,80,4,S,sols,,,198,1.628771,50.186462
2020-1159016,2020-01-16,000001,Vente,180000,294,,RUE DE NEUVILLE,0620,80230,80721,Saint-Valery-sur-Somme,80,,,80721000AH0461,,,,,,,,,,,,,0,1,Maison,60,4,S,sols,,,147,1.630939,50.184552
2020-1159016,2020-01-16,000001,Vente,180000,,,RUE DE NEUVILLE,0620,80230,80721,Saint-Valery-sur-Somme,80,,,80721000AH0464,,,,,,,,,,,,,0,,,,,S,sols,,,159,1.631161,50.184644
2020-1159016,2020-01-16,000001,Vente,180000,,,RUE DE NEUVILLE,0620,80230,80721,Saint-Valery-sur-Somme,80,,,80721000AH0465,,,,,,,,,,,,,0,,,,,S,sols,,,4,1.631084,50.184615
2020-1159044,2020-01-14,000001,Vente,160000,39,,RUE AU FEURRE,0350,80230,80721,Saint-Valery-sur-Somme,80,,,80721000AB0230,,,,,,,,,,,,,0,1,Maison,44,3,S,sols,,,79,1.625131,50.187764
2020-1159045,2020-01-10,000001,Vente,4000,,,LES BAS CHAMPS DU MOLLENEL,B005,80230,80721,Saint-Valery-sur-Somme,80,,,80721000AL0420,,,,,,,,,,,,,0,,,,,J,jardins,,,854,1.649424,50.175522
2020-1159050,2020-01-27,000001,Vente en l'état futur d'achèvement,191000,,,LE CHANTIER,B015,80230,80721,Saint-Valery-sur-Somme,80,,,80721000AI0386,,,203,,,,,,,,,,1,2,Appartement,56,3,,,,,,1.642231,50.178879
2020-1159050,2020-01-27,000001,Vente en l'état futur d'achèvement,191000,,,LE CHANTIER,B015,80230,80721,Saint-Valery-sur-Somme,80,,,80721000AI0386,,,453,,,,,,,,,,1,3,Dépendance,,0,,,,,,1.642231,50.178879
2020-1159054,2020-01-17,000001,Vente en l'état futur d'achèvement,167000,,,LE CHANTIER,B015,80230,80721,Saint-Valery-sur-Somme,80,,,80721000AI0386,,,4,,,,,,,,,,1,2,Appartement,45,2,,,,,,1.642231,50.178879
2020-1159054,2020-01-17,000001,Vente en l'état futur d'achèvement,167000,,,LE CHANTIER,B015,80230,80721,Saint-Valery-sur-Somme,80,,,80721000AI0386,,,403,,,,,,,,,,1,3,Dépendance,,0,,,,,,1.642231,50.178879
2020-1159079,2020-01-06,000001,Vente,130000,809,,RUE SAINT PIERRE,0870,80230,80721,Saint-Valery-sur-Somme,80,,,80721000AE0249,,,,,,,,,,,,,0,1,Maison,29,2,S,sols,,,135,1.632653,50.181348
2020-1159102,2020-01-27,000001,Vente,165000,4,,RUE PASTEUR,0632,80230,80721,Saint-Valery-sur-Somme,80,,,80721000AH0506,,,15,,,,,,,,,,1,3,Dépendance,,0,,,,,,1.63307,50.18811
2020-1159102,2020-01-27,000001,Vente,165000,4,,RUE PASTEUR,0632,80230,80721,Saint-Valery-sur-Somme,80,,,80721000AH0506,,,20,,,,,,,,,,1,2,Appartement,31,1,,,,,,1.63307,50.18811
2020-1159124,2020-02-07,000001,Vente,280000,136,,RUE DES MOULINS,0600,80230,80721,Saint-Valery-sur-Somme,80,,,80721000AH0532,,,,,,,,,,,,,0,1,Maison,125,4,S,sols,,,499,1.638558,50.185498
2020-1159124,2020-02-07,000001,Vente,280000,,,SEN DU CALVAIRE,0120,80230,80721,Saint-Valery-sur-Somme,80,,,80721000AH0533,,,,,,,,,,,,,0,,,,,S,sols,,,1,1.638655,50.185543
2020-1159124,2020-02-07,000001,Vente,280000,,,RUE DES MOULINS,0600,80230,80721,Saint-Valery-sur-Somme,80,,,80721000AH0536,,,,,,,,,,,,,0,,,,,J,jardins,,,2,1.638612,50.18555
2020-1159198,2020-02-07,000001,Vente,2628.8,,,AUX LONGUES ROYES,B048,80230,80721,Saint-Valery-sur-Somme,80,,,80721000AT0093,,,,,,,,,,,,,0,,,,,T,terres,,,6572,1.616261,50.172169
2020-1159324,2020-02-10,000001,Vente,170500,,,LE BOIS DES SOEURS NORD,B011,80230,80721,Saint-Valery-sur-Somme,80,,,80721000AD0058,,,6,,,,,,,,,,1,1,Maison,50,3,,,,,,1.624281,50.181105
2020-1159324,2020-02-10,000001,Vente,170500,,,LE BOIS DES SOEURS NORD,B011,80230,80721,Saint-Valery-sur-Somme,80,,,80721000AD0058,,,28,,,,,,,,,,1,3,Dépendance,,0,,,,,,1.624281,50.181105
2020-1159324,2020-02-10,000001,Vente,170500,,,LE BOIS DES SOEURS NORD,B011,80230,80721,Saint-Valery-sur-Somme,80,,,80721000AD0058,,,35,,,,,,,,,,1,3,Dépendance,,0,,,,,,1.624281,50.181105
2020-1159329,2020-02-08,000001,Vente,192000,,,LE BOIS DES SOEURS NORD,B011,80230,80721,Saint-Valery-sur-Somme,80,,,80721000AD0058,,,5,,,,,,,,,,1,1,Maison,59,3,,,,,,1.624281,50.181105
2020-1159329,2020-02-08,000001,Vente,192000,,,LE BOIS DES SOEURS NORD,B011,80230,80721,Saint-Valery-sur-Somme,80,,,80721000AD0058,,,29,,,,,,,,,,1,3,Dépendance,,0,,,,,,1.624281,50.181105
2020-1159338,2020-02-17,000001,Vente,240000,215,,RUE DU CHANTIER,0160,80230,80721,Saint-Valery-sur-Somme,80,,,80721000AI0353,,,,,,,,,,,,,0,1,Maison,70,4,S,sols,,,91,1.643858,50.178786
2020-1159342,2020-02-11,000001,Vente,146500,143,,RUE DU SOLEIL LEVANT,0893,80230,80721,Saint-Valery-sur-Somme,80,,,80721000AL0324,,,,,,,,,,,,,0,1,Maison,49,3,S,sols,,,858,1.643499,50.176251
2020-1159482,2020-02-26,000001,Vente,439815,77,,QUAI BLAVET,0090,80230,80721,Saint-Valery-sur-Somme,80,,,80721000AH0028,,,,,,,,,,,,,0,1,Maison,177,9,S,sols,,,73,1.639963,50.186325
2020-1159644,2020-03-09,000001,Echange,15000,,,RUE DE NEUVILLE,0620,80230,80721,Saint-Valery-sur-Somme,80,,,80721000AH0538,,,,,,,,,,,,,0,,,,,S,sols,,,20,1.631067,50.186158
2020-1159644,2020-03-09,000002,Echange,15000,,,RUE DE NEUVILLE,0620,80230,80721,Saint-Valery-sur-Somme,80,,,80721000AH0541,,,,,,,,,,,,,0,,,,,S,sols,,,19,1.631148,50.186071
2020-1159782,2020-04-24,000001,Vente,15148.4,,,A LA MIZENNE,B049,80230,80721,Saint-Valery-sur-Somme,80,,,80721000AV0026,,,,,,,,,,,,,0,,,,,T,terres,,,2951,1.600461,50.176989
2020-1159782,2020-04-24,000001,Vente,15148.4,,,LA GARENNE,B044,80230,80721,Saint-Valery-sur-Somme,80,,,80721000AV0263,,,,,,,,,,,,,0,,,,,T,terres,,,11250,1.604828,50.177489
2020-1159930,2020-05-12,000001,Vente,300000,25,,RUE DOCTEUR PROSPER RAVIN,0270,80230,80721,Saint-Valery-sur-Somme,80,,,80721000AI0068,,,10,,7,,,,,,,,2,3,Dépendance,,0,,,,,,1.642688,50.184088
2020-1159930,2020-05-12,000001,Vente,300000,42,,RUE DOCTEUR PROSPER RAVIN,0270,80230,80721,Saint-Valery-sur-Somme,80,,,80721000AI0219,,,,,,,,,,,,,0,1,Maison,112,3,S,sols,,,246,1.642353,50.18405
2020-1159930,2020-05-12,000001,Vente,300000,,,LA FERTE,B040,80230,80721,Saint-Valery-sur-Somme,80,,,80721000AI0220,,,,,,,,,,,,,0,,,,,J,jardins,,,572,1.641935,50.18399
2020-1160001,2020-05-25,000001,Vente,275000,18,B,QUAI VIOLETTE,0900,80230,80721,Saint-Valery-sur-Somme,80,,,80721000AH0104,,,,,,,,,,,,,0,1,Maison,56,2,S,sols,,,36,1.638086,50.186466
2020-1160001,2020-05-25,000001,Vente,275000,18,B,QUAI VIOLETTE,0900,80230,80721,Saint-Valery-sur-Somme,80,,,80721000AH0104,,,,,,,,,,,,,0,4,Local industriel. commercial ou assimilé,15,0,S,sols,,,36,1.638086,50.186466
2020-1160028,2020-03-31,000002,Vente,1500000,301,,RUE SAINT PIERRE,0870,80230,80721,Saint-Valery-sur-Somme,80,,,80721000AI0664,,,,,,,,,,,,,0,1,Maison,324,9,S,sols,,,66,1.638851,50.183877
2020-1160028,2020-03-31,000002,Vente,1500000,,,RUE SAINT PIERRE,0870,80230,80721,Saint-Valery-sur-Somme,80,,,80721000AI0665,,,,,,,,,,,,,0,,,,,S,sols,,,1865,1.638586,50.183679
2020-1160028,2020-03-31,000002,Vente,1500000,,,RUE SAINT PIERRE,0870,80230,80721,Saint-Valery-sur-Somme,80,,,80721000AI0666,,,,,,,,,,,,,0,,,,,S,sols,,,20,1.638749,50.183457
2020-1160028,2020-03-31,000002,Vente,1500000,,,CHEM CHAPELLE AUX CORDERIE,B017,80230,80721,Saint-Valery-sur-Somme,80,,,80721000AI0667,,,,,,,,,,,,,0,,,,,BS,taillis sous futaie,,,11268,1.637221,50.182961
2020-1160028,2020-03-31,000002,Vente,1500000,,,CHEM CHAPELLE AUX CORDERIE,B017,80230,80721,Saint-Valery-sur-Somme,80,,,80721000AI0669,,,,,,,,,,,,,0,,,,,BS,taillis sous futaie,,,2382,1.638644,50.183173
2020-1160028,2020-03-31,000002,Vente,1500000,,,CHEM CHAPELLE AUX CORDERIE,B017,80230,80721,Saint-Valery-sur-Somme,80,,,80721000AI0670,,,,,,,,,,,,,0,,,,,BS,taillis sous futaie,,,4,1.638758,50.183372
2020-1160028,2020-03-31,000002,Vente,1500000,,,CHEM CHAPELLE AUX CORDERIE,B017,80230,80721,Saint-Valery-sur-Somme,80,,,80721000AI0671,,,,,,,,,,,,,0,,,,,J,jardins,,,17,1.638859,50.183104
2020-1160028,2020-03-31,000002,Vente,1500000,,,CHEM CHAPELLE AUX CORDERIE,B017,80230,80721,Saint-Valery-sur-Somme,80,,,80721000AI0672,,,,,,,,,,,,,0,,,,,J,jardins,,,1222,1.639207,50.183095
2020-1160028,2020-03-31,000002,Vente,1500000,,,CHEM CHAPELLE AUX CORDERIE,B017,80230,80721,Saint-Valery-sur-Somme,80,,,80721000AI0673,,,,,,,,,,,,,0,,,,,J,jardins,,,3369,1.639348,50.183362
2020-1160028,2020-03-31,000002,Vente,1500000,,,CHEM CHAPELLE AUX CORDERIE,B017,80230,80721,Saint-Valery-sur-Somme,80,,,80721000AI0674,,,,,,,,,,,,,0,,,,,AG,terrains d'agrément,,,3420,1.639198,50.183759
2020-1160028,2020-03-31,000002,Vente,1500000,,,CHEM CHAPELLE AUX CORDERIE,B017,80230,80721,Saint-Valery-sur-Somme,80,,,80721000AI0675,,,,,,,,,,,,,0,,,,,AG,terrains d'agrément,,,8,1.638837,50.18361
2020-1160071,2020-06-12,000001,Vente en l'état futur d'achèvement,238200,,,LE CHANTIER,B015,80230,80721,Saint-Valery-sur-Somme,80,,,80721000AI0386,,,102,,,,,,,,,,1,2,Appartement,69,3,,,,,,1.642231,50.178879
2020-1160071,2020-06-12,000001,Vente en l'état futur d'achèvement,238200,,,LE CHANTIER,B015,80230,80721,Saint-Valery-sur-Somme,80,,,80721000AI0386,,,418,,,,,,,,,,1,3,Dépendance,,0,,,,,,1.642231,50.178879
2020-1160105,2020-06-08,000001,Vente,110000,1023,,RUE DU CHANTIER,0160,80230,80721,Saint-Valery-sur-Somme,80,,,80721000AL0445,,,89,28.59,,,,,,,,,1,2,Appartement,29,1,,,,,,1.644024,50.177592
2020-1160105,2020-06-08,000001,Vente,110000,1023,,RUE DU CHANTIER,0160,80230,80721,Saint-Valery-sur-Somme,80,,,80721000AL0445,,,107,,,,,,,,,,1,3,Dépendance,,0,,,,,,1.644024,50.177592
2020-1160105,2020-06-08,000001,Vente,110000,1023,,RUE DU CHANTIER,0160,80230,80721,Saint-Valery-sur-Somme,80,,,80721000AL0445,,,108,,,,,,,,,,1,3,Dépendance,,0,,,,,,1.644024,50.177592
2020-1160265,2020-06-24,000001,Vente en l'état futur d'achèvement,178000,,,LE CHANTIER,B015,80230,80721,Saint-Valery-sur-Somme,80,,,80721000AI0386,,,215,,,,,,,,,,1,2,Appartement,46,2,,,,,,1.642231,50.178879
2020-1160265,2020-06-24,000001,Vente en l'état futur d'achèvement,178000,,,LE CHANTIER,B015,80230,80721,Saint-Valery-sur-Somme,80,,,80721000AI0386,,,414,,,,,,,,,,1,3,Dépendance,,0,,,,,,1.642231,50.178879
2020-1160278,2020-05-20,000001,Vente,291000,249,,RTE DE GAMACHES,0365,80230,80721,Saint-Valery-sur-Somme,80,,,80721000AO0098,,,,,,,,,,,,,0,1,Maison,115,5,S,sols,,,695,1.626372,50.165617
2020-1160278,2020-05-20,000001,Vente,291000,249,,RTE DE GAMACHES,0365,80230,80721,Saint-Valery-sur-Somme,80,,,80721000AO0098,,,,,,,,,,,,,0,1,Maison,115,5,AG,terrains d'agrément,,,892,1.626372,50.165617
2020-1160295,2020-05-12,000001,Vente,43537.2,667,,RUE DES MARTINETS,0544,80230,80721,Saint-Valery-sur-Somme,80,,,80721000AL0647,,,,,,,,,,,,,0,,,,,AB,terrains a bâtir,,,511,1.645359,50.173275
2020-1160296,2020-05-12,000002,Vente,,667,,RUE DES MARTINETS,0544,80230,80721,Saint-Valery-sur-Somme,80,,,80721000AL0647,,,,,,,,,,,,,0,,,,,AB,terrains a bâtir,,,511,1.645359,50.173275
2020-1160315,2020-06-29,000001,Vente,360000,9005,F,RUE DU MOLLENELLE,0550,80230,80721,Saint-Valery-sur-Somme,80,,,80721000AL0148,,,,,,,,,,,,,0,3,Dépendance,,0,S,sols,,,524,1.645701,50.172629
2020-1160315,2020-06-29,000001,Vente,360000,9005,F,RUE DU MOLLENELLE,0550,80230,80721,Saint-Valery-sur-Somme,80,,,80721000AL0148,,,,,,,,,,,,,0,1,Maison,45,2,S,sols,,,524,1.645701,50.172629
2020-1160315,2020-06-29,000001,Vente,360000,9005,F,RUE DU MOLLENELLE,0550,80230,80721,Saint-Valery-sur-Somme,80,,,80721000AL0148,,,,,,,,,,,,,0,3,Dépendance,,0,S,sols,,,524,1.645701,50.172629
2020-1160315,2020-06-29,000001,Vente,360000,9005,F,RUE DU MOLLENELLE,0550,80230,80721,Saint-Valery-sur-Somme,80,,,80721000AL0148,,,,,,,,,,,,,0,3,Dépendance,,0,S,sols,,,524,1.645701,50.172629
2020-1160315,2020-06-29,000001,Vente,360000,9005,F,RUE DU MOLLENELLE,0550,80230,80721,Saint-Valery-sur-Somme,80,,,80721000AL0148,,,,,,,,,,,,,0,3,Dépendance,,0,S,sols,,,524,1.645701,50.172629
2020-1160315,2020-06-29,000001,Vente,360000,10,,RUE DU MOLLENELLE,0550,80230,80721,Saint-Valery-sur-Somme,80,,,80721000AL0382,,,,,,,,,,,,,0,2,Appartement,65,3,S,sols,,,384,1.645844,50.172521
2020-1160315,2020-06-29,000001,Vente,360000,10,,RUE DU MOLLENELLE,0550,80230,80721,Saint-Valery-sur-Somme,80,,,80721000AL0382,,,,,,,,,,,,,0,2,Appartement,38,1,S,sols,,,384,1.645844,50.172521
2020-1160315,2020-06-29,000001,Vente,360000,10,,RUE DU MOLLENELLE,0550,80230,80721,Saint-Valery-sur-Somme,80,,,80721000AL0382,,,,,,,,,,,,,0,2,Appartement,64,3,S,sols,,,384,1.645844,50.172521
2020-1160315,2020-06-29,000001,Vente,360000,10,,RUE DU MOLLENELLE,0550,80230,80721,Saint-Valery-sur-Somme,80,,,80721000AL0382,,,,,,,,,,,,,0,3,Dépendance,,0,S,sols,,,384,1.645844,50.172521
2020-1160315,2020-06-29,000001,Vente,360000,10,,RUE DU MOLLENELLE,0550,80230,80721,Saint-Valery-sur-Somme,80,,,80721000AL0382,,,,,,,,,,,,,0,2,Appartement,32,1,S,sols,,,384,1.645844,50.172521
2020-1160315,2020-06-29,000001,Vente,360000,,,LE MOLLENELLE,B050,80230,80721,Saint-Valery-sur-Somme,80,,,80721000AL0386,,,,,,,,,,,,,0,,,,,S,sols,,,165,1.646092,50.172602
2020-1160317,2020-06-27,000001,Vente,170000,8,,RUE DES PLUVIERS,0665,80230,80721,Saint-Valery-sur-Somme,80,,,80721000AD0045,,,8,,,,,,,,,,1,1,Maison,45,3,,,,,,,
2020-1160317,2020-06-27,000001,Vente,170000,1,,RUE DES COURLIS,0205,80230,80721,Saint-Valery-sur-Somme,80,,,80721000AD0045,,,247,,,,,,,,,,1,3,Dépendance,,0,,,,,,,
2020-1160317,2020-06-27,000001,Vente,170000,8,,RUE DES PLUVIERS,0665,80230,80721,Saint-Valery-sur-Somme,80,,,80721000AD0045,,,21,,,,,,,,,,1,3,Dépendance,,0,,,,,,,
2020-1160348,2020-06-17,000001,Vente,11500,,,AU FOSSE DE SAINT VALERY,B043,80230,80721,Saint-Valery-sur-Somme,80,,,80721000AT0043,,,,,,,,,,,,,0,,,,,T,terres,,,16010,1.61234,50.173239
2020-1160348,2020-06-17,000001,Vente,11500,,,AU FOSSE DE SAINT VALERY,B043,80230,80721,Saint-Valery-sur-Somme,80,,,80721000AT0044,,,,,,,,,,,,,0,,,,,T,terres,,,4195,1.612186,50.17375
2020-1160348,2020-06-17,000001,Vente,11500,,,LA FERME DE LA GARENNE,B037,80230,80721,Saint-Valery-sur-Somme,80,,,80721000AT0059,,,,,,,,,,,,,0,,,,,T,terres,,,3777,1.616466,50.17671
2020-1160348,2020-06-17,000001,Vente,11500,,,LA FERME DE LA GARENNE,B037,80230,80721,Saint-Valery-sur-Somme,80,,,80721000AT0061,,,,,,,,,,,,,0,,,,,T,terres,,,3995,1.616886,50.176939
2020-1160368,2020-06-19,000001,Vente,815565,,,LE SOLEIL LEVANT SUD,B078,80230,80721,Saint-Valery-sur-Somme,80,,,80721000AM0141,,,,,,,,,,,,,0,,,,,P,prés,,,22733,1.638752,50.176
2020-1160415,2020-07-01,000001,Vente,298000,243,,RUE DES MARTINETS,0544,80230,80721,Saint-Valery-sur-Somme,80,,,80721000AL0219,,,,,,,,,,,,,0,1,Maison,96,4,S,sols,,,659,1.646963,50.17512
2020-1160420,2020-06-17,000001,Vente,100000,17,,RUE DE LA FERTE,0340,80230,80721,Saint-Valery-sur-Somme,80,,,80721000AI0087,,,104,,,,,,,,,,1,3,Dépendance,,0,,,,,,1.642824,50.184838
2020-1160420,2020-06-17,000001,Vente,100000,17,,RUE DE LA FERTE,0340,80230,80721,Saint-Valery-sur-Somme,80,,,80721000AI0087,,,10,41.58,,,,,,,,,1,2,Appartement,30,2,,,,,,1.642824,50.184838
2020-1160482,2020-06-22,000001,Vente,50523,623,,RUE DES MARTINETS,0544,80230,80721,Saint-Valery-sur-Somme,80,,,80721000AL0649,,,,,,,,,,,,,0,,,,,AB,terrains a bâtir,,,593,1.64589,50.173242
2020-1160482,2020-06-22,000002,Vente,50523,623,,RUE DES MARTINETS,0544,80230,80721,Saint-Valery-sur-Somme,80,,,80721000AL0649,,,,,,,,,,,,,0,,,,,AB,terrains a bâtir,,,593,1.64589,50.173242
2020-1160483,2020-06-22,000001,Vente,49842,637,,RUE DES MARTINETS,0544,80230,80721,Saint-Valery-sur-Somme,80,,,80721000AL0648,,,,,,,,,,,,,0,,,,,AB,terrains a bâtir,,,585,1.645641,50.173293
2020-1160483,2020-06-22,000002,Vente,49842,637,,RUE DES MARTINETS,0544,80230,80721,Saint-Valery-sur-Somme,80,,,80721000AL0648,,,,,,,,,,,,,0,,,,,AB,terrains a bâtir,,,585,1.645641,50.173293
2020-1160511,2020-07-15,000001,Vente,550000,4,,RUE PASTEUR,0632,80230,80721,Saint-Valery-sur-Somme,80,,,80721000AH0506,,,23,88.6,24,,,,,,,,2,2,Appartement,89,2,,,,,,1.63307,50.18811
2020-1160511,2020-07-15,000001,Vente,550000,4,,RUE PASTEUR,0632,80230,80721,Saint-Valery-sur-Somme,80,,,80721000AH0506,,,3,,,,,,,,,,1,3,Dépendance,,0,,,,,,1.63307,50.18811
2020-1160511,2020-07-15,000001,Vente,550000,4,,RUE PASTEUR,0632,80230,80721,Saint-Valery-sur-Somme,80,,,80721000AH0506,,,18,,,,,,,,,,1,3,Dépendance,,0,,,,,,1.63307,50.18811
2020-1160511,2020-07-15,000001,Vente,550000,4,,RUE PASTEUR,0632,80230,80721,Saint-Valery-sur-Somme,80,,,80721000AH0506,,,10,,,,,,,,,,1,3,Dépendance,,0,,,,,,1.63307,50.18811
2020-1160582,2020-07-28,000001,Vente,39438,,,CHEM CHAPELLE AUX CORDERIE,B017,80230,80721,Saint-Valery-sur-Somme,80,,,80721000AI0667,,,,,,,,,,,,,0,,,,,BS,taillis sous futaie,,,11268,1.637221,50.182961
2020-1160654,2020-07-15,000001,Vente,105000,17,,RUE DE LA FERTE,0340,80230,80721,Saint-Valery-sur-Somme,80,,,80721000AI0087,,,101,,,,,,,,,,1,3,Dépendance,,0,,,,,,1.642824,50.184838
2020-1160654,2020-07-15,000001,Vente,105000,17,,RUE DE LA FERTE,0340,80230,80721,Saint-Valery-sur-Somme,80,,,80721000AI0087,,,11,,,,,,,,,,1,2,Appartement,46,2,,,,,,1.642824,50.184838
2020-1160793,2020-07-31,000001,Vente,90000,1,,RUE DU MOLLENELLE,0550,80230,80721,Saint-Valery-sur-Somme,80,,,80721000AM0059,,,,,,,,,,,,,0,1,Maison,28,1,S,sols,,,325,1.646432,50.171883
2020-1161044,2020-09-10,000001,Vente,294150,,,RUE DE LA CROIX L ABBE,0230,80230,80721,Saint-Valery-sur-Somme,80,,,80721000AH0356,,,,,,,,,,,,,0,,,,,J,jardins,,,1473,1.629079,50.185977
2020-1161044,2020-09-10,000001,Vente,294150,,,RUE DE LA CROIX L ABBE,0230,80230,80721,Saint-Valery-sur-Somme,80,,,80721000AH0356,,,,,,,,,,,,,0,,,,,S,sols,,,130,1.629079,50.185977
2020-1161044,2020-09-10,000001,Vente,294150,33,,RUE DU DOCTEUR LEGER,0250,80230,80721,Saint-Valery-sur-Somme,80,,,80721000AH0548,,,,,,,,,,,,,0,1,Maison,139,6,S,sols,,,304,1.628707,50.186397
2020-1161083,2020-09-04,000001,Vente,135000,17,,RUE DE LA FERTE,0340,80230,80721,Saint-Valery-sur-Somme,80,,,80721000AI0087,,,17,,18,,,,,,,,2,2,Appartement,62,3,,,,,,1.642824,50.184838
2020-1161083,2020-09-04,000001,Vente,135000,17,,RUE DE LA FERTE,0340,80230,80721,Saint-Valery-sur-Somme,80,,,80721000AI0087,,,103,,,,,,,,,,1,3,Dépendance,,0,,,,,,1.642824,50.184838
2020-1161134,2020-09-22,000001,Vente,80000,,,LA FERTE,B040,80230,80721,Saint-Valery-sur-Somme,80,,,80721000AI0662,,,,,,,,,,,,,0,,,,,J,jardins,,,2163,1.641373,50.182998
2020-1161223,2020-10-02,000001,Vente,130000,15,D,RUE DES COURLIS,0205,80230,80721,Saint-Valery-sur-Somme,80,,,80721000AD0049,,,,,,,,,,,,,0,1,Maison,69,3,S,sols,,,422,1.622754,50.18232
2020-1161271,2020-09-30,000001,Vente,175500,,,LE BOIS DES SOEURS NORD,B011,80230,80721,Saint-Valery-sur-Somme,80,,,80721000AD0058,,,34,,,,,,,,,,1,3,Dépendance,,0,,,,,,1.624281,50.181105
2020-1161271,2020-09-30,000001,Vente,175500,,,LE BOIS DES SOEURS NORD,B011,80230,80721,Saint-Valery-sur-Somme,80,,,80721000AD0058,,,9,,,,,,,,,,1,1,Maison,50,3,,,,,,1.624281,50.181105
2020-1161293,2020-09-17,000001,Vente,370000,105,,RUE D ARGOULES,0050,80230,80721,Saint-Valery-sur-Somme,80,,,80721000AI0103,,,,,,,,,,,,,0,1,Maison,145,7,S,sols,,,72,1.641289,50.185538
2020-1161447,2020-10-07,000001,Vente en l'état futur d'achèvement,184000,,,LE CHANTIER,B015,80230,80721,Saint-Valery-sur-Somme,80,,,80721000AI0386,,,3,,,,,,,,,,1,2,Appartement,50,2,,,,,,1.642231,50.178879
2020-1161447,2020-10-07,000001,Vente en l'état futur d'achèvement,184000,,,LE CHANTIER,B015,80230,80721,Saint-Valery-sur-Somme,80,,,80721000AI0386,,,413,,,,,,,,,,1,3,Dépendance,,0,,,,,,1.642231,50.178879
2020-1161470,2020-10-15,000001,Vente en l'état futur d'achèvement,171000,,,LE CHANTIER,B015,80230,80721,Saint-Valery-sur-Somme,80,,,80721000AI0386,,,409,,,,,,,,,,1,3,Dépendance,,0,,,,,,1.642231,50.178879
2020-1161470,2020-10-15,000001,Vente en l'état futur d'achèvement,171000,,,LE CHANTIER,B015,80230,80721,Saint-Valery-sur-Somme,80,,,80721000AI0386,,,2,,,,,,,,,,1,2,Appartement,46,2,,,,,,1.642231,50.178879
2020-1161474,2020-10-15,000001,Vente en l'état futur d'achèvement,189000,,,LE CHANTIER,B015,80230,80721,Saint-Valery-sur-Somme,80,,,80721000AI0386,,,404,,,,,,,,,,1,3,Dépendance,,0,,,,,,1.642231,50.178879
2020-1161474,2020-10-15,000001,Vente en l'état futur d'achèvement,189000,,,LE CHANTIER,B015,80230,80721,Saint-Valery-sur-Somme,80,,,80721000AI0386,,,1,,,,,,,,,,1,2,Appartement,52,2,,,,,,1.642231,50.178879
2020-1161531,2020-10-24,000001,Vente,170000,556,,RUE SAINT PIERRE,0870,80230,80721,Saint-Valery-sur-Somme,80,,,80721000AE0115,,,4,60.63,,,,,,,,,1,1,Maison,61,3,,,,,,1.635082,50.183003
2020-1161531,2020-10-24,000001,Vente,170000,9002,F,RUE SAINT PIERRE,0870,80230,80721,Saint-Valery-sur-Somme,80,,,80721000AE0115,,,17,,,,,,,,,,1,3,Dépendance,,0,,,,,,1.635082,50.183003
2020-1161577,2020-10-29,000001,Vente,181370,8,,RUE JULES BRULE,0470,80230,80721,Saint-Valery-sur-Somme,80,,,80721000AB0559,,,10,46.3,,,,,,,,,1,2,Appartement,46,3,,,,,,1.631152,50.187834
2020-1161577,2020-10-29,000001,Vente,181370,8,,RUE JULES BRULE,0470,80230,80721,Saint-Valery-sur-Somme,80,,,80721000AB0559,,,2,,,,,,,,,,1,3,Dépendance,,0,,,,,,1.631152,50.187834
2020-1161680,2020-10-16,000001,Vente,293900,3,,RUE ROCHE MADONE,0790,80230,80721,Saint-Valery-sur-Somme,80,,,80721000AH0077,,,,,,,,,,,,,0,1,Maison,68,4,S,sols,,,39,1.639385,50.186059