id_mutation,date_mutation,numero_disposition,nature_mutation,valeur_fonciere,adresse_numero,adresse_suffixe,adresse_nom_voie,adresse_code_voie,code_postal,code_commune,nom_commune,code_departement,ancien_code_commune,ancien_nom_commune,id_parcelle,ancien_id_parcelle,numero_volume,lot1_numero,lot1_surface_carrez,lot2_numero,lot2_surface_carrez,lot3_numero,lot3_surface_carrez,lot4_numero,lot4_surface_carrez,lot5_numero,lot5_surface_carrez,nombre_lots,code_type_local,type_local,surface_reelle_bati,nombre_pieces_principales,code_nature_culture,nature_culture,code_nature_culture_speciale,nature_culture_speciale,surface_terrain,longitude,latitude
2020-1159273,2020-02-15,000001,Vente,185750,8,,RUE D OISEMONT,0070,80140,80767,Le Translay,80,,,807670000B0493,,,,,,,,,,,,,0,1,Maison,152,4,J,jardins,,,1423,1.678982,49.967079
2020-1159273,2020-02-15,000001,Vente,185750,8,,RUE D OISEMONT,0070,80140,80767,Le Translay,80,,,807670000B0493,,,,,,,,,,,,,0,1,Maison,152,4,S,sols,,,725,1.678982,49.967079
2020-1159273,2020-02-15,000001,Vente,185750,10,,RUE D OISEMONT,0070,80140,80767,Le Translay,80,,,807670000B0588,,,,,,,,,,,,,0,,,,,J,jardins,,,294,1.678644,49.966737
2020-1159855,2020-05-25,000001,Vente,200000,4,,IMP DES MARRONNIERS,0053,80140,80767,Le Translay,80,,,807670000A0152,,,,,,,,,,,,,0,1,Maison,80,3,S,sols,,,1800,1.651856,49.973595
2020-1159855,2020-05-25,000001,Vente,200000,,,A BUSMENARD,B002,80140,80767,Le Translay,80,,,807670000A0185,,,,,,,,,,,,,0,,,,,S,sols,,,1093,1.651948,49.973744
2020-1159855,2020-05-25,000001,Vente,200000,,,A BUSMENARD,B002,80140,80767,Le Translay,80,,,807670000A0185,,,,,,,,,,,,,0,,,,,P,prés,,,2067,1.651948,49.973744
2020-1161192,2020-10-03,000001,Vente,190000,1,B,RUE DE FRAMICOURT,0040,80140,80767,Le Translay,80,,,807670000B0547,,,,,,,,,,,,,0,1,Maison,125,4,S,sols,,,500,1.678345,49.967509
2020-1161192,2020-10-03,000001,Vente,190000,1,B,RUE DE FRAMICOURT,0040,80140,80767,Le Translay,80,,,807670000B0547,,,,,,,,,,,,,0,1,Maison,125,4,J,jardins,,,805,1.678345,49.967509
2020-1162032,2020-12-04,000001,Vente,120000,6,,RUE DE BUSMENARD,0022,80140,80767,Le Translay,80,,,80767000ZK0051,,,,,,,,,,,,,0,1,Maison,108,3,S,sols,,,847,1.671205,49.967754
2020-1162035,2020-12-01,000001,Vente,226630,8,,RUE D ABBEVILLE,0005,80140,80767,Le Translay,80,,,807670000B0242,,,,,,,,,,,,,0,1,Maison,128,5,J,jardins,,,2076,1.677065,49.970631
2020-1162035,2020-12-01,000001,Vente,226630,8,,RUE D ABBEVILLE,0005,80140,80767,Le Translay,80,,,807670000B0242,,,,,,,,,,,,,0,1,Maison,128,5,S,sols,,,666,1.677065,49.970631
