id_mutation,date_mutation,numero_disposition,nature_mutation,valeur_fonciere,adresse_numero,adresse_suffixe,adresse_nom_voie,adresse_code_voie,code_postal,code_commune,nom_commune,code_departement,ancien_code_commune,ancien_nom_commune,id_parcelle,ancien_id_parcelle,numero_volume,lot1_numero,lot1_surface_carrez,lot2_numero,lot2_surface_carrez,lot3_numero,lot3_surface_carrez,lot4_numero,lot4_surface_carrez,lot5_numero,lot5_surface_carrez,nombre_lots,code_type_local,type_local,surface_reelle_bati,nombre_pieces_principales,code_nature_culture,nature_culture,code_nature_culture_speciale,nature_culture_speciale,surface_terrain,longitude,latitude
2020-1168373,2020-09-22,000002,Vente,480800,,,LAS BRUGUES,B017,81540,81027,Belleserre,81,,,810270000A0151,,,,,,,,,,,,,0,,,,,BS,taillis sous futaie,,,14150,2.065522,43.496704
2020-1168373,2020-09-22,000002,Vente,480800,,,LAS BRUGUES,B017,81540,81027,Belleserre,81,,,810270000A0152,,,,,,,,,,,,,0,,,,,P,prés,,,3580,2.064757,43.496757
2020-1168373,2020-09-22,000002,Vente,480800,,,LAS BRUGUES,B017,81540,81027,Belleserre,81,,,810270000A0153,,,,,,,,,,,,,0,,,,,S,sols,,,12,2.064381,43.497566
2020-1168373,2020-09-22,000002,Vente,480800,,,LAS BRUGUES,B017,81540,81027,Belleserre,81,,,810270000A0153,,,,,,,,,,,,,0,,,,,P,prés,,,10498,2.064381,43.497566
2020-1168373,2020-09-22,000002,Vente,480800,,,LAS BRUGUES,B017,81540,81027,Belleserre,81,,,810270000A0895,,,,,,,,,,,,,0,,,,,T,terres,,,5564,2.064648,43.496019
2020-1168373,2020-09-22,000002,Vente,480800,,,LAS BRUGUES,B017,81540,81027,Belleserre,81,,,810270000A1428,,,,,,,,,,,,,0,,,,,S,sols,,,4637,2.063692,43.497073
2020-1168374,2020-09-22,000003,Vente,200000,5014,,LAS BRUGUES,B017,81540,81027,Belleserre,81,,,810270000A0753,,,,,,,,,,,,,0,3,Dépendance,,0,S,sols,,,849,2.063854,43.496542
2020-1168374,2020-09-22,000003,Vente,200000,5014,,LAS BRUGUES,B017,81540,81027,Belleserre,81,,,810270000A1427,,,,,,,,,,,,,0,1,Maison,128,5,S,sols,,,1165,2.064069,43.496701
2020-1168374,2020-09-22,000003,Vente,200000,5014,,LAS BRUGUES,B017,81540,81027,Belleserre,81,,,810270000A1427,,,,,,,,,,,,,0,1,Maison,180,7,S,sols,,,1165,2.064069,43.496701
2020-1168374,2020-09-22,000003,Vente,200000,5014,,LAS BRUGUES,B017,81540,81027,Belleserre,81,,,810270000A1427,,,,,,,,,,,,,0,3,Dépendance,,0,S,sols,,,1165,2.064069,43.496701
2020-1168374,2020-09-22,000003,Vente,200000,5014,,LAS BRUGUES,B017,81540,81027,Belleserre,81,,,810270000A1427,,,,,,,,,,,,,0,3,Dépendance,,0,S,sols,,,1165,2.064069,43.496701
2020-1168374,2020-09-22,000003,Vente,200000,5014,,LAS BRUGUES,B017,81540,81027,Belleserre,81,,,810270000A1427,,,,,,,,,,,,,0,3,Dépendance,,0,S,sols,,,1165,2.064069,43.496701
2020-1168374,2020-09-22,000003,Vente,200000,5014,,LAS BRUGUES,B017,81540,81027,Belleserre,81,,,810270000A1427,,,,,,,,,,,,,0,1,Maison,54,3,S,sols,,,1165,2.064069,43.496701
2020-1168374,2020-09-22,000003,Vente,200000,5014,,LAS BRUGUES,B017,81540,81027,Belleserre,81,,,810270000A1427,,,,,,,,,,,,,0,1,Maison,54,2,S,sols,,,1165,2.064069,43.496701
2020-1169131,2020-10-30,000001,Vente,12592,,,LE GARIOT,B014,81540,81027,Belleserre,81,,,810270000A0562,,,,,,,,,,,,,0,,,,,T,terres,,,13220,2.065548,43.48107
2020-1173025,2020-06-25,000002,Vente,510,,,LA PEYRADE,B020,81540,81027,Belleserre,81,,,810270000A1421,,,,,,,,,,,,,0,,,,,T,terres,,,17,2.04989,43.48922
2020-1173331,2020-07-07,000002,Vente,36900,,,BARRI BAS,B002,81540,81027,Belleserre,81,,,810270000A1412,,,,,,,,,,,,,0,,,,,P,prés,,,738,2.05465,43.489108
