id_mutation,date_mutation,numero_disposition,nature_mutation,valeur_fonciere,adresse_numero,adresse_suffixe,adresse_nom_voie,adresse_code_voie,code_postal,code_commune,nom_commune,code_departement,ancien_code_commune,ancien_nom_commune,id_parcelle,ancien_id_parcelle,numero_volume,lot1_numero,lot1_surface_carrez,lot2_numero,lot2_surface_carrez,lot3_numero,lot3_surface_carrez,lot4_numero,lot4_surface_carrez,lot5_numero,lot5_surface_carrez,nombre_lots,code_type_local,type_local,surface_reelle_bati,nombre_pieces_principales,code_nature_culture,nature_culture,code_nature_culture_speciale,nature_culture_speciale,surface_terrain,longitude,latitude
2020-1174015,2020-01-16,000001,Vente,205000,,,SAINT ROMAIN,B152,82220,82144,Puycornet,82,,,82144000AM0199,,,,,,,,,,,,,0,,,,,T,terres,,,1155,1.354274,44.142649
2020-1174015,2020-01-16,000001,Vente,205000,5152,,SAINT ROMAIN,B152,82220,82144,Puycornet,82,,,82144000AM0202,,,,,,,,,,,,,0,1,Maison,116,4,S,sols,,,653,1.353787,44.142852
2020-1174644,2020-02-27,000002,Vente,46000,,,REYNAR,B142,82220,82144,Puycornet,82,,,82144000AT0483,,,,,,,,,,,,,0,,,,,T,terres,,,2000,1.314987,44.153281
2020-1176128,2020-05-28,000001,Vente,40000,,,RIVAL,B144,82220,82144,Puycornet,82,,,82144000AT0453,,,,,,,,,,,,,0,,,,,P,prés,,,5,1.320828,44.155054
2020-1176128,2020-05-28,000001,Vente,40000,,,RIVAL,B144,82220,82144,Puycornet,82,,,82144000AT0454,,,,,,,,,,,,,0,,,,,P,prés,,,411,,
2020-1176128,2020-05-28,000001,Vente,40000,,,RIVAL,B144,82220,82144,Puycornet,82,,,82144000AT0456,,,,,,,,,,,,,0,,,,,T,terres,,,1198,,
2020-1176177,2020-06-29,000001,Vente,95000,5161,,ROUZET,B149,82220,82144,Puycornet,82,,,82144000BL0086,,,,,,,,,,,,,0,1,Maison,90,3,S,sols,,,1114,1.278701,44.159108
2020-1177072,2020-08-20,000001,Vente,45000,,,CRESTOU,B049,82220,82144,Puycornet,82,,,82144000AV0353,,,,,,,,,,,,,0,,,,,T,terres,,,2000,1.315411,44.143326
2020-1177358,2020-08-25,000001,Vente,280000,5124,A,COUGOURNAC,B043,82220,82144,Puycornet,82,,,82144000AZ0065,,,,,,,,,,,,,0,1,Maison,109,4,S,sols,,,520,1.302058,44.140108
2020-1177358,2020-08-25,000001,Vente,280000,5185,,COUGOURNAC,B043,82220,82144,Puycornet,82,,,82144000AZ0184,,,,,,,,,,,,,0,3,Dépendance,,0,T,terres,,,4436,1.301688,44.139971
2020-1177358,2020-08-25,000001,Vente,280000,5185,,COUGOURNAC,B043,82220,82144,Puycornet,82,,,82144000AZ0184,,,,,,,,,,,,,0,3,Dépendance,,0,S,sols,,,449,1.301688,44.139971
2020-1177358,2020-08-25,000001,Vente,280000,,,COUGOURNAC,B043,82220,82144,Puycornet,82,,,82144000AZ0185,,,,,,,,,,,,,0,,,,,T,terres,,,66,1.301896,44.140235
2020-1177495,2020-08-28,000001,Vente,34000,,,ILE DE LARTIGUE,B072,82220,82144,Puycornet,82,,,82144000BL0001,,,,,,,,,,,,,0,,,,,T,terres,,,752,1.280922,44.164651
2020-1177495,2020-08-28,000001,Vente,34000,,,ILE DE LARTIGUE,B072,82220,82144,Puycornet,82,,,82144000BL0002,,,,,,,,,,,,,0,,,,,T,terres,,,768,1.281466,44.164846
2020-1177495,2020-08-28,000001,Vente,34000,,,ILE DE LARTIGUE,B072,82220,82144,Puycornet,82,,,82144000BL0003,,,,,,,,,,,,,0,,,,,T,terres,,,11660,1.282601,44.165131
2020-1177495,2020-08-28,000001,Vente,34000,,,ILE DE LARTIGUE,B072,82220,82144,Puycornet,82,,,82144000BL0004,,,,,,,,,,,,,0,,,,,T,terres,,,1300,1.283103,44.16532
2020-1177495,2020-08-28,000001,Vente,34000,,,ILE DE LARTIGUE,B072,82220,82144,Puycornet,82,,,82144000BL0005,,,,,,,,,,,,,0,,,,,T,terres,,,1480,1.283243,44.164978
2020-1177495,2020-08-28,000001,Vente,34000,,,ILE DE LARTIGUE,B072,82220,82144,Puycornet,82,,,82144000BL0007,,,,,,,,,,,,,0,,,,,T,terres,,,6213,1.278279,44.163552
2020-1177495,2020-08-28,000001,Vente,34000,,,ILE DE LARTIGUE,B072,82220,82144,Puycornet,82,,,82144000BL0008,,,,,,,,,,,,,0,,,,,T,terres,,,2331,1.277912,44.162898
2020-1177495,2020-08-28,000001,Vente,34000,,,ILE DE LARTIGUE,B072,82220,82144,Puycornet,82,,,82144000BL0009,,,,,,,,,,,,,0,,,,,T,terres,,,2020,1.27724,44.162683
2020-1177495,2020-08-28,000001,Vente,34000,,,ILE DE LARTIGUE,B072,82220,82144,Puycornet,82,,,82144000BL0093,,,,,,,,,,,,,0,,,,,T,terres,,,5059,1.281835,44.164623
2020-1177495,2020-08-28,000001,Vente,34000,,,ILE DE LARTIGUE,B072,82220,82144,Puycornet,82,,,82144000BL0094,,,,,,,,,,,,,0,,,,,T,terres,,,14571,1.279683,44.164119
2020-1178490,2020-10-26,000001,Vente,192600,1804,,RTE DE LA MAIRIE,0130,82220,82144,Puycornet,82,,,82144000AT0425,,,,,,,,,,,,,0,1,Maison,75,3,J,jardins,POTAG,Jardin potager,2362,1.32332,44.155165
2020-1178490,2020-10-26,000001,Vente,192600,1804,,RTE DE LA MAIRIE,0130,82220,82144,Puycornet,82,,,82144000AT0425,,,,,,,,,,,,,0,1,Maison,75,3,S,sols,,,1000,1.32332,44.155165
2020-1178867,2020-11-27,000001,Vente,48000,95,,RTE DE L'HONOR DE COS,0097,82220,82144,Puycornet,82,,,82144000AV0297,,,,,,,,,,,,,0,,,,,T,terres,,,2277,1.315754,44.143421
2020-1179082,2020-11-26,000001,Vente,175700,,,TITOUL,B166,82220,82144,Puycornet,82,,,82144000AT0152,,,,,,,,,,,,,0,,,,,T,terres,,,3040,1.326095,44.152308
2020-1179082,2020-11-26,000001,Vente,175700,,,TITOUL,B166,82220,82144,Puycornet,82,,,82144000AT0317,,,,,,,,,,,,,0,,,,,T,terres,,,4611,1.326275,44.152754
2020-1179082,2020-11-26,000001,Vente,175700,,,TITOUL,B166,82220,82144,Puycornet,82,,,82144000AT0319,,,,,,,,,,,,,0,,,,,T,terres,,,261,1.325871,44.153125
2020-1179082,2020-11-26,000001,Vente,175700,195,,IMP DE RIVAL,0245,82220,82144,Puycornet,82,,,82144000AT0321,,,,,,,,,,,,,0,1,Maison,99,4,S,sols,,,2088,1.326071,44.15304
2020-1179137,2020-11-27,000002,Vente,185000,79,,IMP DE TITOUL,0450,82220,82144,Puycornet,82,,,82144000AT0489,,,,,,,,,,,,,0,1,Maison,127,4,,,,,,1.323501,44.154696
2020-1179303,2020-12-21,000001,Vente,100000,811,,RTE DU CHATEAU DE LISLE,0045,82220,82144,Puycornet,82,,,82144000AS0058,,,,,,,,,,,,,0,1,Maison,90,4,S,sols,,,3382,1.318308,44.161364
2020-1179303,2020-12-21,000001,Vente,100000,,,JAMMES,B073,82220,82144,Puycornet,82,,,82144000AS0255,,,,,,,,,,,,,0,,,,,S,sols,,,38,1.319101,44.161526
2020-1179303,2020-12-21,000001,Vente,100000,,,JAMMES,B073,82220,82144,Puycornet,82,,,82144000AS0259,,,,,,,,,,,,,0,,,,,S,sols,,,2898,1.318564,44.161443
2020-1179386,2020-12-11,000001,Vente,243500,994,,RTE DE MOLIERES,0145,82220,82144,Puycornet,82,,,82144000AM0044,,,,,,,,,,,,,0,1,Maison,97,5,S,sols,,,1296,1.354871,44.149723
2020-1179386,2020-12-11,000001,Vente,243500,,,SAINT-ROMAIN,B152,82220,82144,Puycornet,82,,,82144000AM0045,,,,,,,,,,,,,0,,,,,VE,vergers,CERIS,Cerisaie ou cerisiers,973,1.355153,44.149498
