id_mutation,date_mutation,numero_disposition,nature_mutation,valeur_fonciere,adresse_numero,adresse_suffixe,adresse_nom_voie,adresse_code_voie,code_postal,code_commune,nom_commune,code_departement,ancien_code_commune,ancien_nom_commune,id_parcelle,ancien_id_parcelle,numero_volume,lot1_numero,lot1_surface_carrez,lot2_numero,lot2_surface_carrez,lot3_numero,lot3_surface_carrez,lot4_numero,lot4_surface_carrez,lot5_numero,lot5_surface_carrez,nombre_lots,code_type_local,type_local,surface_reelle_bati,nombre_pieces_principales,code_nature_culture,nature_culture,code_nature_culture_speciale,nature_culture_speciale,surface_terrain,longitude,latitude
2020-1177259,2020-08-26,000001,Vente,152000,5098,,PATET,B068,82300,82174,Saint-Vincent-d'Autéjac,82,,,821740000B0653,,,,,,,,,,,,,0,1,Maison,106,4,T,terres,,,1752,1.488014,44.148876
2020-1177259,2020-08-26,000001,Vente,152000,5098,,PATET,B068,82300,82174,Saint-Vincent-d'Autéjac,82,,,821740000B0653,,,,,,,,,,,,,0,1,Maison,106,4,S,sols,,,927,1.488014,44.148876
2020-1178033,2020-09-24,000001,Vente,55000,,,ESPINASSES,B035,82300,82174,Saint-Vincent-d'Autéjac,82,,,821740000B0272,,,,,,,,,,,,,0,,,,,BT,taillis simples,,,650,1.483922,44.162805
2020-1178033,2020-09-24,000001,Vente,55000,,,ESPINASSES,B035,82300,82174,Saint-Vincent-d'Autéjac,82,,,821740000B0277,,,,,,,,,,,,,0,,,,,E,eaux,LAC,Lac,1180,1.486479,44.163007
2020-1178033,2020-09-24,000001,Vente,55000,,,ESPINASSES,B035,82300,82174,Saint-Vincent-d'Autéjac,82,,,821740000B0277,,,,,,,,,,,,,0,,,,,T,terres,,,5288,1.486479,44.163007
2020-1178033,2020-09-24,000001,Vente,55000,,,ESPINASSES,B035,82300,82174,Saint-Vincent-d'Autéjac,82,,,821740000B0278,,,,,,,,,,,,,0,,,,,T,terres,,,615,1.486764,44.162501
2020-1178033,2020-09-24,000001,Vente,55000,,,ESPINASSES,B035,82300,82174,Saint-Vincent-d'Autéjac,82,,,821740000B0278,,,,,,,,,,,,,0,,,,,T,terres,,,1070,1.486764,44.162501
2020-1178033,2020-09-24,000001,Vente,55000,,,ESPINASSES,B035,82300,82174,Saint-Vincent-d'Autéjac,82,,,821740000B0278,,,,,,,,,,,,,0,,,,,E,eaux,LAC,Lac,915,1.486764,44.162501
2020-1178033,2020-09-24,000001,Vente,55000,,,ESPINASSES,B035,82300,82174,Saint-Vincent-d'Autéjac,82,,,821740000B0279,,,,,,,,,,,,,0,,,,,T,terres,,,910,1.485575,44.162893
2020-1178033,2020-09-24,000001,Vente,55000,,,ESPINASSES,B035,82300,82174,Saint-Vincent-d'Autéjac,82,,,821740000B0280,,,,,,,,,,,,,0,,,,,T,terres,,,1930,1.485249,44.162537
2020-1178033,2020-09-24,000001,Vente,55000,,,ESPINASSES,B035,82300,82174,Saint-Vincent-d'Autéjac,82,,,821740000B0281,,,,,,,,,,,,,0,,,,,T,terres,,,4213,1.485164,44.162021
2020-1178033,2020-09-24,000001,Vente,55000,,,ESPINASSES,B035,82300,82174,Saint-Vincent-d'Autéjac,82,,,821740000B0282,,,,,,,,,,,,,0,,,,,T,terres,,,7730,1.484688,44.161329
2020-1178033,2020-09-24,000001,Vente,55000,,,ESPINASSES,B035,82300,82174,Saint-Vincent-d'Autéjac,82,,,821740000B0283,,,,,,,,,,,,,0,,,,,T,terres,,,8087,1.48597,44.162235
2020-1178033,2020-09-24,000001,Vente,55000,,,ESPINASSES,B035,82300,82174,Saint-Vincent-d'Autéjac,82,,,821740000B0284,,,,,,,,,,,,,0,,,,,T,terres,,,7940,1.486287,44.161768
2020-1178033,2020-09-24,000001,Vente,55000,,,LA MOULINE,B065,82300,82174,Saint-Vincent-d'Autéjac,82,,,821740000B0285,,,,,,,,,,,,,0,,,,,T,terres,,,12670,1.487802,44.162042
2020-1178033,2020-09-24,000001,Vente,55000,,,LA MOULINE,B065,82300,82174,Saint-Vincent-d'Autéjac,82,,,821740000B0286,,,,,,,,,,,,,0,,,,,T,terres,,,2395,1.487092,44.161689
2020-1178033,2020-09-24,000001,Vente,55000,5035,,LA MOULINE,B065,82300,82174,Saint-Vincent-d'Autéjac,82,,,821740000B0287,,,,,,,,,,,,,0,1,Maison,46,2,S,sols,,,2773,1.487683,44.161033
2020-1178033,2020-09-24,000001,Vente,55000,,,LA MOULINE,B065,82300,82174,Saint-Vincent-d'Autéjac,82,,,821740000B0288,,,,,,,,,,,,,0,,,,,T,terres,,,9381,1.486626,44.161055
2020-1178033,2020-09-24,000001,Vente,55000,,,LA MOULINE,B065,82300,82174,Saint-Vincent-d'Autéjac,82,,,821740000B0289,,,,,,,,,,,,,0,,,,,T,terres,,,2494,1.486447,44.160786
2020-1178033,2020-09-24,000001,Vente,55000,,,LA MOULINE,B065,82300,82174,Saint-Vincent-d'Autéjac,82,,,821740000B0290,,,,,,,,,,,,,0,,,,,T,terres,,,9028,1.486312,44.160518
2020-1178033,2020-09-24,000001,Vente,55000,,,LA MOULINE,B065,82300,82174,Saint-Vincent-d'Autéjac,82,,,821740000B0291,,,,,,,,,,,,,0,,,,,T,terres,,,1560,1.485676,44.160294
2020-1178033,2020-09-24,000001,Vente,55000,,,LA MOULINE,B065,82300,82174,Saint-Vincent-d'Autéjac,82,,,821740000B0293,,,,,,,,,,,,,0,,,,,T,terres,,,1330,1.485726,44.159926
2020-1178033,2020-09-24,000001,Vente,55000,,,LA MOULINE,B065,82300,82174,Saint-Vincent-d'Autéjac,82,,,821740000B0294,,,,,,,,,,,,,0,,,,,T,terres,,,2650,1.48636,44.159872
2020-1178033,2020-09-24,000001,Vente,55000,,,LA NAUZE,B066,82300,82174,Saint-Vincent-d'Autéjac,82,,,821740000B0485,,,,,,,,,,,,,0,,,,,P,prés,,,710,1.485399,44.160703
2020-1178033,2020-09-24,000001,Vente,55000,,,LA NAUZE,B066,82300,82174,Saint-Vincent-d'Autéjac,82,,,821740000B0486,,,,,,,,,,,,,0,,,,,E,eaux,LAC,Lac,536,1.485197,44.16079
2020-1178033,2020-09-24,000001,Vente,55000,,,LA NAUZE,B066,82300,82174,Saint-Vincent-d'Autéjac,82,,,821740000B0486,,,,,,,,,,,,,0,,,,,T,terres,,,414,1.485197,44.16079
2020-1178033,2020-09-24,000001,Vente,55000,,,LA NAUZE,B066,82300,82174,Saint-Vincent-d'Autéjac,82,,,821740000B0487,,,,,,,,,,,,,0,,,,,T,terres,,,1050,1.484942,44.160907
2020-1178033,2020-09-24,000001,Vente,55000,,,LA NAUZE,B066,82300,82174,Saint-Vincent-d'Autéjac,82,,,821740000B0488,,,,,,,,,,,,,0,,,,,BT,taillis simples,,,950,1.484659,44.160941
2020-1178033,2020-09-24,000001,Vente,55000,,,LA NAUZE,B066,82300,82174,Saint-Vincent-d'Autéjac,82,,,821740000B0490,,,,,,,,,,,,,0,,,,,BT,taillis simples,,,680,1.483852,44.160921
2020-1179177,2020-12-08,000001,Vente,329615,5080,,BARRAU,B006,82300,82174,Saint-Vincent-d'Autéjac,82,,,821740000D0036,,,,,,,,,,,,,0,1,Maison,118,3,S,sols,,,3057,1.451661,44.176951
2020-1179177,2020-12-08,000001,Vente,329615,,,BARRAU,B006,82300,82174,Saint-Vincent-d'Autéjac,82,,,821740000D0836,,,,,,,,,,,,,0,,,,,T,terres,,,7234,1.452243,44.176567
2020-1179177,2020-12-08,000001,Vente,329615,,,BARRAU,B006,82300,82174,Saint-Vincent-d'Autéjac,82,,,821740000D0838,,,,,,,,,,,,,0,,,,,T,terres,,,2852,1.451372,44.176519
2020-1179177,2020-12-08,000001,Vente,329615,,,BARRAU,B006,82300,82174,Saint-Vincent-d'Autéjac,82,,,821740000D0840,,,,,,,,,,,,,0,,,,,T,terres,,,12,1.451219,44.176326
