id_mutation,date_mutation,numero_disposition,nature_mutation,valeur_fonciere,adresse_numero,adresse_suffixe,adresse_nom_voie,adresse_code_voie,code_postal,code_commune,nom_commune,code_departement,ancien_code_commune,ancien_nom_commune,id_parcelle,ancien_id_parcelle,numero_volume,lot1_numero,lot1_surface_carrez,lot2_numero,lot2_surface_carrez,lot3_numero,lot3_surface_carrez,lot4_numero,lot4_surface_carrez,lot5_numero,lot5_surface_carrez,nombre_lots,code_type_local,type_local,surface_reelle_bati,nombre_pieces_principales,code_nature_culture,nature_culture,code_nature_culture_speciale,nature_culture_speciale,surface_terrain,longitude,latitude
2020-1224008,2020-06-25,000001,Vente,50000,5056,,LE VILLAGE,B082,84390,84021,Brantes,84,,,840210000E0486,,,,,,,,,,,,,0,1,Maison,26,1,S,sols,,,42,5.333296,44.193373
2020-1224008,2020-06-25,000001,Vente,50000,,,LE VILLAGE,B082,84390,84021,Brantes,84,,,840210000E0487,,,,,,,,,,,,,0,,,,,L,landes,,,288,5.333278,44.193285
2020-1224588,2020-09-24,000001,Echange,850,,,LADRE,B044,84390,84021,Brantes,84,,,840210000E0194,,,,,,,,,,,,,0,,,,,B,bois,,,1600,5.325313,44.201084
2020-1224588,2020-09-24,000001,Echange,850,,,LADRE,B044,84390,84021,Brantes,84,,,840210000E0195,,,,,,,,,,,,,0,,,,,B,bois,,,2850,5.325471,44.200721
2020-1224588,2020-09-24,000001,Echange,850,,,LADRE,B044,84390,84021,Brantes,84,,,840210000E0196,,,,,,,,,,,,,0,,,,,VE,vergers,OLIVE,Oliveraie ou oliviers,2330,5.325552,44.20025
2020-1224589,2020-09-24,000002,Echange,1100,,,LES TUILIERES,B075,84390,84021,Brantes,84,,,840210000E0043,,,,,,,,,,,,,0,,,,,L,landes,,,3330,5.324583,44.20268
2020-1224589,2020-09-24,000002,Echange,1100,,,LADRE,B044,84390,84021,Brantes,84,,,840210000E0183,,,,,,,,,,,,,0,,,,,L,landes,,,600,5.325279,44.202858
2020-1224589,2020-09-24,000002,Echange,1100,,,LADRE,B044,84390,84021,Brantes,84,,,840210000E0184,,,,,,,,,,,,,0,,,,,T,terres,,,6480,5.324807,44.202506
2020-1224925,2020-10-27,000001,Vente,120000,,,LA CLAPEIRIES,B009,84390,84021,Brantes,84,,,840210000B0235,,,,,,,,,,,,,0,,,,,T,terres,,,2940,5.337005,44.195129
