id_mutation,date_mutation,numero_disposition,nature_mutation,valeur_fonciere,adresse_numero,adresse_suffixe,adresse_nom_voie,adresse_code_voie,code_postal,code_commune,nom_commune,code_departement,ancien_code_commune,ancien_nom_commune,id_parcelle,ancien_id_parcelle,numero_volume,lot1_numero,lot1_surface_carrez,lot2_numero,lot2_surface_carrez,lot3_numero,lot3_surface_carrez,lot4_numero,lot4_surface_carrez,lot5_numero,lot5_surface_carrez,nombre_lots,code_type_local,type_local,surface_reelle_bati,nombre_pieces_principales,code_nature_culture,nature_culture,code_nature_culture_speciale,nature_culture_speciale,surface_terrain,longitude,latitude
2020-1212718,2020-01-08,000002,Vente,50000,99,,CHE DE LEUZE,0197,84330,84030,Caromb,84,,,840300000D2064,,,,,,,,,,,,,0,3,Dépendance,,0,AB,terrains a bâtir,,,300,5.100825,44.100369
2020-1212762,2020-01-09,000001,Vente,80568,,,LA COMBE,B021,84330,84030,Caromb,84,,,840300000C0376,,,,,,,,,,,,,0,,,,,VI,vignes,,,8000,5.102748,44.08089
2020-1212762,2020-01-09,000001,Vente,80568,,,LA COMBE,B021,84330,84030,Caromb,84,,,840300000C0378,,,,,,,,,,,,,0,,,,,VI,vignes,,,3680,5.101956,44.080145
2020-1212762,2020-01-09,000001,Vente,80568,,,LA COMBE,B021,84330,84030,Caromb,84,,,840300000C0938,,,,,,,,,,,,,0,,,,,VI,vignes,,,1700,5.103174,44.081438
2020-1212874,2020-01-28,000001,Vente,150000,157,,AV JEAN MOULIN,0323,84330,84030,Caromb,84,,,840300000F0838,,,,,,,,,,,,,0,1,Maison,67,3,S,sols,,,377,5.105295,44.111683
2020-1212874,2020-01-28,000001,Vente,150000,5896,,LES CLOS,B018,84330,84030,Caromb,84,,,840300000F0880,,,,,,,,,,,,,0,3,Dépendance,,0,S,sols,,,269,5.105164,44.111697
2020-1212881,2020-01-08,000001,Vente,60000,5,,IMP CAZAN,0121,84330,84030,Caromb,84,,,840300000F0231,,,,,,,,,,,,,0,1,Maison,85,3,S,sols,,,29,5.107362,44.1106
2020-1212896,2020-01-20,000001,Vente,43000,,,LA GRAND COMBE,B035,84330,84030,Caromb,84,,,840300000A0900,,,,,,,,,,,,,0,,,,,L,landes,,,6220,5.126994,44.128252
2020-1212896,2020-01-20,000001,Vente,43000,,,LA GRAND COMBE,B035,84330,84030,Caromb,84,,,840300000A0911,,,,,,,,,,,,,0,,,,,S,sols,,,20,5.12644,44.128544
2020-1212896,2020-01-20,000001,Vente,43000,,,LA GRAND COMBE,B035,84330,84030,Caromb,84,,,840300000A0912,,,,,,,,,,,,,0,,,,,L,landes,,,7110,5.126659,44.128953
2020-1212971,2020-01-09,000002,Echange,5000,,,LA BARRE,B005,84330,84030,Caromb,84,,,840300000A0007,,,,,,,,,,,,,0,,,,,VI,vignes,,,3500,5.12554,44.118498
2020-1212971,2020-01-09,000002,Echange,5000,,,LA BARRE,B005,84330,84030,Caromb,84,,,840300000A0013,,,,,,,,,,,,,0,,,,,VI,vignes,,,2440,5.124617,44.118653
2020-1212971,2020-01-09,000003,Echange,5000,,,LA BARRE,B005,84330,84030,Caromb,84,,,840300000A0010,,,,,,,,,,,,,0,,,,,VI,vignes,,,2350,5.124286,44.117802
2020-1212971,2020-01-09,000003,Echange,5000,,,LA BARRE,B005,84330,84030,Caromb,84,,,840300000A1938,,,,,,,,,,,,,0,,,,,VI,vignes,,,2322,5.12362,44.117927
2020-1212976,2020-01-16,000001,Vente,113000,5712,,LES AIRES,B002,84330,84030,Caromb,84,,,840300000F0788,,,13,,,,,,,,,,1,3,Dépendance,,0,,,,,,5.105715,44.106978
2020-1212976,2020-01-16,000001,Vente,113000,5712,,LES AIRES,B002,84330,84030,Caromb,84,,,840300000F0788,,,11,72.37,,,,,,,,,1,2,Appartement,98,3,,,,,,5.105715,44.106978
2020-1212995,2020-01-27,000001,Vente,300000,40,,LES CLOS,B018,84330,84030,Caromb,84,,,840300000F1131,,,,,,,,,,,,,0,3,Dépendance,,0,T,terres,,,250,5.102441,44.109413
2020-1212995,2020-01-27,000001,Vente,300000,40,,LES CLOS,B018,84330,84030,Caromb,84,,,840300000F1131,,,,,,,,,,,,,0,2,Appartement,96,4,T,terres,,,250,5.102441,44.109413
2020-1212995,2020-01-27,000001,Vente,300000,40,,LES CLOS,B018,84330,84030,Caromb,84,,,840300000F1131,,,,,,,,,,,,,0,3,Dépendance,,0,S,sols,,,1000,5.102441,44.109413
2020-1212995,2020-01-27,000001,Vente,300000,40,,LES CLOS,B018,84330,84030,Caromb,84,,,840300000F1131,,,,,,,,,,,,,0,2,Appartement,49,2,S,sols,,,1000,5.102441,44.109413
2020-1212995,2020-01-27,000001,Vente,300000,40,,LES CLOS,B018,84330,84030,Caromb,84,,,840300000F1131,,,,,,,,,,,,,0,2,Appartement,96,4,S,sols,,,1000,5.102441,44.109413
2020-1212995,2020-01-27,000001,Vente,300000,40,,LES CLOS,B018,84330,84030,Caromb,84,,,840300000F1131,,,,,,,,,,,,,0,2,Appartement,49,2,T,terres,,,250,5.102441,44.109413
2020-1213112,2020-01-23,000001,Vente,3000,,,CHEMIN DE CRILLON,B014,84330,84030,Caromb,84,,,840300000B0364,,,,,,,,,,,,,0,,,,,VI,vignes,,,2235,5.115603,44.111857
2020-1213113,2020-01-23,000002,Vente,15000,,,PREYAUTS,B063,84330,84030,Caromb,84,,,840300000B0624,,,,,,,,,,,,,0,,,,,VI,vignes,,,780,5.112895,44.104364
2020-1213113,2020-01-23,000002,Vente,15000,,,PREYAUTS,B063,84330,84030,Caromb,84,,,840300000B0625,,,,,,,,,,,,,0,,,,,VI,vignes,,,1655,5.112924,44.104706
2020-1213113,2020-01-23,000002,Vente,15000,,,PREYAUTS,B063,84330,84030,Caromb,84,,,840300000B0626,,,,,,,,,,,,,0,,,,,S,sols,,,25,5.112698,44.104859
2020-1213113,2020-01-23,000002,Vente,15000,,,PREYAUTS,B063,84330,84030,Caromb,84,,,840300000B0627,,,,,,,,,,,,,0,,,,,VI,vignes,,,528,5.112605,44.104797
2020-1213113,2020-01-23,000002,Vente,15000,,,PREYAUTS,B063,84330,84030,Caromb,84,,,840300000B0628,,,,,,,,,,,,,0,,,,,P,prés,,,1455,5.11231,44.104733
2020-1213163,2020-01-06,000001,Vente,121000,149,F,CHE DE MONTFORT,0352,84330,84030,Caromb,84,,,840300000E2187,,,,,,,,,,,,,0,,,,,AB,terrains a bâtir,,,523,5.109215,44.121881
2020-1213207,2020-01-08,000002,Vente,1475.88,,,LEUZE,B040,84330,84030,Caromb,84,,,840300000D2072,,,,,,,,,,,,,0,,,,,VI,vignes,,,1004,5.094811,44.095943
2020-1213302,2020-01-30,000001,Vente,109000,216,,IMP DES CYPRES,0138,84330,84030,Caromb,84,,,840300000D2053,,,,,,,,,,,,,0,,,,,AB,terrains a bâtir,,,483,5.102898,44.105165
2020-1213323,2020-01-28,000001,Vente,118000,80,B,CHE DE MONTFORT,0352,84330,84030,Caromb,84,,,840300000E2188,,,,,,,,,,,,,0,1,Maison,95,3,S,sols,,,493,5.109199,44.122133
2020-1213444,2020-02-24,000001,Vente,102000,106,,TRA SAINT AMBROISE,0645,84330,84030,Caromb,84,,,840300000B2006,,,,,,,,,,,,,0,1,Maison,79,3,S,sols,,,473,5.103048,44.099929
2020-1213511,2020-02-18,000001,Vente,410000,80,A,IMP DES IRIS,0321,84330,84030,Caromb,84,,,840300000A1787,,,,,,,,,,,,,0,3,Dépendance,,0,T,terres,,,1510,5.113428,44.114934
2020-1213511,2020-02-18,000001,Vente,410000,80,A,IMP DES IRIS,0321,84330,84030,Caromb,84,,,840300000A1787,,,,,,,,,,,,,0,1,Maison,133,4,T,terres,,,1510,5.113428,44.114934
2020-1213511,2020-02-18,000001,Vente,410000,80,A,IMP DES IRIS,0321,84330,84030,Caromb,84,,,840300000A1787,,,,,,,,,,,,,0,1,Maison,133,4,S,sols,,,500,5.113428,44.114934
2020-1213511,2020-02-18,000001,Vente,410000,80,A,IMP DES IRIS,0321,84330,84030,Caromb,84,,,840300000A1787,,,,,,,,,,,,,0,3,Dépendance,,0,S,sols,,,500,5.113428,44.114934
2020-1213668,2020-03-13,000001,Vente,77650,281,,CRS DE LA REPUBLIQUE,0052,84330,84030,Caromb,84,,,840300000F0072,,,10,,,,,,,,,,1,2,Appartement,39,2,,,,,,5.106664,44.111744
2020-1213710,2020-03-12,000001,Vente,2200,,,LA COMBE,B021,84330,84030,Caromb,84,,,840300000C0851,,,,,,,,,,,,,0,,,,,VI,vignes,,,2895,5.099711,44.088251
2020-1213751,2020-02-20,000001,Vente,177500,6484,,RUE DORE,0146,84330,84030,Caromb,84,,,840300000F1087,,,,,,,,,,,,,0,1,Maison,70,3,S,sols,,,67,5.107671,44.110872
2020-1213903,2020-03-27,000001,Vente,15000,281,,CRS DE LA REPUBLIQUE,0052,84330,84030,Caromb,84,,,840300000F0072,,,4,,,,,,,,,,1,4,Local industriel. commercial ou assimilé,14,0,,,,,,5.106664,44.111744
2020-1213909,2020-03-11,000001,Vente,72000,281,,CRS DE LA REPUBLIQUE,0052,84330,84030,Caromb,84,,,840300000F0072,,,12,34.18,15,,,,,,,,2,3,Dépendance,,0,,,,,,5.106664,44.111744
2020-1213909,2020-03-11,000001,Vente,72000,281,,CRS DE LA REPUBLIQUE,0052,84330,84030,Caromb,84,,,840300000F0072,,,12,34.18,15,,,,,,,,2,2,Appartement,50,3,,,,,,5.106664,44.111744
2020-1213943,2020-03-16,000001,Vente,187000,36,,GR GRAND RUE,0309,84330,84030,Caromb,84,,,840300000F0315,,,,,,,,,,,,,0,1,Maison,90,5,S,sols,,,54,5.107613,44.111058
2020-1214032,2020-04-01,000001,Vente,499000,60,,IMP DE LA GARDETTE,0312,84330,84030,Caromb,84,,,840300000A1606,,,,,,,,,,,,,0,1,Maison,159,5,S,sols,,,500,5.11118,44.11677
2020-1214032,2020-04-01,000001,Vente,499000,60,,IMP DE LA GARDETTE,0312,84330,84030,Caromb,84,,,840300000A1606,,,,,,,,,,,,,0,3,Dépendance,,0,S,sols,,,500,5.11118,44.11677
2020-1214032,2020-04-01,000001,Vente,499000,60,,IMP DE LA GARDETTE,0312,84330,84030,Caromb,84,,,840300000A1606,,,,,,,,,,,,,0,3,Dépendance,,0,S,sols,,,500,5.11118,44.11677
2020-1214032,2020-04-01,000001,Vente,499000,60,,IMP DE LA GARDETTE,0312,84330,84030,Caromb,84,,,840300000A1606,,,,,,,,,,,,,0,3,Dépendance,,0,T,terres,,,1410,5.11118,44.11677
2020-1214032,2020-04-01,000001,Vente,499000,60,,IMP DE LA GARDETTE,0312,84330,84030,Caromb,84,,,840300000A1606,,,,,,,,,,,,,0,3,Dépendance,,0,T,terres,,,1410,5.11118,44.11677
2020-1214032,2020-04-01,000001,Vente,499000,60,,IMP DE LA GARDETTE,0312,84330,84030,Caromb,84,,,840300000A1606,,,,,,,,,,,,,0,1,Maison,159,5,T,terres,,,1410,5.11118,44.11677
2020-1214032,2020-04-01,000001,Vente,499000,,,GARDETTE,B033,84330,84030,Caromb,84,,,840300000A1609,,,,,,,,,,,,,0,,,,,S,sols,,,8,5.111317,44.117683
2020-1214038,2020-04-23,000001,Vente,30000,,,PRADETS,B061,84330,84030,Caromb,84,,,840300000E0539,,,,,,,,,,,,,0,,,,,S,sols,,,25,5.095155,44.114765
2020-1214038,2020-04-23,000001,Vente,30000,,,PRADETS,B061,84330,84030,Caromb,84,,,840300000E1578,,,,,,,,,,,,,0,,,,,VE,vergers,,,330,5.095748,44.114403
2020-1214038,2020-04-23,000001,Vente,30000,,,PRADETS,B061,84330,84030,Caromb,84,,,840300000E1579,,,,,,,,,,,,,0,,,,,VE,vergers,,,160,5.095895,44.11468
2020-1214038,2020-04-23,000001,Vente,30000,,,PRADETS,B061,84330,84030,Caromb,84,,,840300000E1583,,,,,,,,,,,,,0,,,,,VE,vergers,,,6407,5.095582,44.114857
2020-1214105,2020-05-06,000001,Vente,125500,129,,AV CHARLES DE GAULLE,0117,84330,84030,Caromb,84,,,840300000E0443,,,,,,,,,,,,,0,1,Maison,65,1,S,sols,,,75,5.107945,44.113314
2020-1214156,2020-04-30,000001,Vente,205000,5677,,CHE DE CRILLON,0129,84330,84030,Caromb,84,,,840300000F0507,,,,,,,,,,,,,0,2,Appartement,80,3,S,sols,,,460,5.10994,44.112377
2020-1214156,2020-04-30,000001,Vente,205000,5677,,CHE DE CRILLON,0129,84330,84030,Caromb,84,,,840300000F0507,,,,,,,,,,,,,0,2,Appartement,84,4,S,sols,,,460,5.10994,44.112377
2020-1214160,2020-03-12,000001,Vente,3000,,,LE BOIS,B006,84330,84030,Caromb,84,,,840300000C0230,,,,,,,,,,,,,0,,,,,B,bois,,,1465,5.112328,44.087793
2020-1214230,2020-05-19,000001,Vente,230000,90,,PCH PETIT CHEMIN DES PRES,0430,84330,84030,Caromb,84,,,840300000B2018,,,,,,,,,,,,,0,1,Maison,99,4,S,sols,,,562,5.107621,44.107649
2020-1214243,2020-04-27,000001,Vente,308450,26,,IMP DE LA PICHOLINE,0445,84330,84030,Caromb,84,,,840300000A1392,,,,,,,,,,,,,0,3,Dépendance,,0,S,sols,,,706,5.110447,44.122213
2020-1214243,2020-04-27,000001,Vente,308450,26,,IMP DE LA PICHOLINE,0445,84330,84030,Caromb,84,,,840300000A1392,,,,,,,,,,,,,0,3,Dépendance,,0,S,sols,,,706,5.110447,44.122213
2020-1214243,2020-04-27,000001,Vente,308450,26,,IMP DE LA PICHOLINE,0445,84330,84030,Caromb,84,,,840300000A1392,,,,,,,,,,,,,0,3,Dépendance,,0,S,sols,,,706,5.110447,44.122213
2020-1214243,2020-04-27,000001,Vente,308450,26,,IMP DE LA PICHOLINE,0445,84330,84030,Caromb,84,,,840300000A1392,,,,,,,,,,,,,0,1,Maison,87,4,S,sols,,,706,5.110447,44.122213
2020-1214282,2020-05-11,000001,Vente,226000,72,,RUE DE LA MIRANDE,0341,84330,84030,Caromb,84,,,840300000F0148,,,3,98.2,,,,,,,,,1,2,Appartement,98,4,,,,,,5.10794,44.109827
2020-1214282,2020-05-11,000001,Vente,226000,72,,RUE DE LA MIRANDE,0341,84330,84030,Caromb,84,,,840300000F0148,,,2,46.5,,,,,,,,,1,2,Appartement,46,2,,,,,,5.10794,44.109827
2020-1214282,2020-05-11,000001,Vente,226000,72,,RUE DE LA MIRANDE,0341,84330,84030,Caromb,84,,,840300000F0148,,,1,,,,,,,,,,1,3,Dépendance,,0,,,,,,5.10794,44.109827
2020-1214347,2020-03-17,000001,Vente,241500,5815,,LANSAS,B038,84330,84030,Caromb,84,,,840300000C1147,,,,,,,,,,,,,0,1,Maison,85,4,T,terres,,,2572,5.094784,44.089031
2020-1214347,2020-03-17,000001,Vente,241500,5815,,LANSAS,B038,84330,84030,Caromb,84,,,840300000C1147,,,,,,,,,,,,,0,1,Maison,85,4,S,sols,,,1000,5.094784,44.089031
2020-1214348,2020-01-27,000001,Vente,12501,,,LEUZE,B040,84330,84030,Caromb,84,,,840300000D2068,,,,,,,,,,,,,0,,,,,T,terres,,,438,5.093248,44.095819
2020-1214348,2020-01-27,000001,Vente,12501,,,LEUZE,B040,84330,84030,Caromb,84,,,840300000D2069,,,,,,,,,,,,,0,,,,,T,terres,,,344,5.093338,44.095978
2020-1214348,2020-01-27,000001,Vente,12501,,,LEUZE,B040,84330,84030,Caromb,84,,,840300000D2071,,,,,,,,,,,,,0,,,,,VI,vignes,,,427,5.094354,44.095957
2020-1214436,2020-05-28,000001,Vente,268000,128,,CRS DE LA REPUBLIQUE,0052,84330,84030,Caromb,84,,,840300000F0225,,,,,,,,,,,,,0,1,Maison,45,2,S,sols,,,66,5.107096,44.110352
2020-1214539,2020-05-22,000001,Vente,50000,5111,,LES PRES,B062,84330,84030,Caromb,84,,,840300000B0728,,,,,,,,,,,,,0,1,Maison,18,1,S,sols,,,155,5.111211,44.106015
2020-1214539,2020-05-22,000001,Vente,50000,,,LES PRES,B062,84330,84030,Caromb,84,,,840300000B0731,,,,,,,,,,,,,0,,,,,VI,vignes,,,2505,5.111025,44.105823
2020-1214539,2020-05-22,000001,Vente,50000,,,LES PRES,B062,84330,84030,Caromb,84,,,840300000B0732,,,,,,,,,,,,,0,,,,,T,terres,,,350,5.110695,44.105559
2020-1214539,2020-05-22,000001,Vente,50000,,,LES PRES,B062,84330,84030,Caromb,84,,,840300000B0733,,,,,,,,,,,,,0,,,,,VI,vignes,,,410,5.110764,44.105968
2020-1214539,2020-05-22,000001,Vente,50000,,,LES PRES,B062,84330,84030,Caromb,84,,,840300000B0734,,,,,,,,,,,,,0,,,,,T,terres,,,750,5.110628,44.10574
2020-1214539,2020-05-22,000001,Vente,50000,,,LES PRES,B062,84330,84030,Caromb,84,,,840300000B0735,,,,,,,,,,,,,0,,,,,T,terres,,,1410,5.110413,44.105757
2020-1214539,2020-05-22,000001,Vente,50000,,,LES PRES,B062,84330,84030,Caromb,84,,,840300000B0736,,,,,,,,,,,,,0,,,,,T,terres,,,2650,5.110669,44.105302
2020-1214539,2020-05-22,000001,Vente,50000,,,FOULIGNAN,B031,84330,84030,Caromb,84,,,840300000D0117,,,,,,,,,,,,,0,,,,,VI,vignes,,,4440,5.093221,44.111876
2020-1214539,2020-05-22,000001,Vente,50000,,,FOULIGNAN,B031,84330,84030,Caromb,84,,,840300000D0118,,,,,,,,,,,,,0,,,,,S,sols,,,20,5.093122,44.111645
2020-1214539,2020-05-22,000001,Vente,50000,,,FOULIGNAN,B031,84330,84030,Caromb,84,,,840300000D0119,,,,,,,,,,,,,0,,,,,VI,vignes,,,1430,5.092993,44.111544
2020-1214539,2020-05-22,000001,Vente,50000,,,FOULIGNAN,B031,84330,84030,Caromb,84,,,840300000D0124,,,,,,,,,,,,,0,,,,,VI,vignes,,,760,5.092977,44.111134
2020-1214539,2020-05-22,000001,Vente,50000,,,LA JARDINE,B036,84330,84030,Caromb,84,,,840300000E0690,,,,,,,,,,,,,0,,,,,VI,vignes,,,920,5.096696,44.117672
2020-1214539,2020-05-22,000001,Vente,50000,,,LA JARDINE,B036,84330,84030,Caromb,84,,,840300000E0691,,,,,,,,,,,,,0,,,,,S,sols,,,190,5.096824,44.117693
2020-1214539,2020-05-22,000001,Vente,50000,,,LA JARDINE,B036,84330,84030,Caromb,84,,,840300000E0692,,,,,,,,,,,,,0,,,,,VE,vergers,,,1450,5.096289,44.117276
2020-1214539,2020-05-22,000001,Vente,50000,,,LA JARDINE,B036,84330,84030,Caromb,84,,,840300000E0692,,,,,,,,,,,,,0,,,,,VI,vignes,,,7500,5.096289,44.117276
2020-1214539,2020-05-22,000001,Vente,50000,,,LA JARDINE,B036,84330,84030,Caromb,84,,,840300000E0702,,,,,,,,,,,,,0,,,,,VE,vergers,,,3120,5.09661,44.118168
2020-1214576,2020-04-17,000001,Vente,8000,,,LA JARDINE,B036,84330,84030,Caromb,84,,,840300000E0678,,,,,,,,,,,,,0,,,,,VE,vergers,,,1620,5.098194,44.116104
2020-1214576,2020-04-17,000001,Vente,8000,,,LA JARDINE,B036,84330,84030,Caromb,84,,,840300000E0679,,,,,,,,,,,,,0,,,,,VE,vergers,,,1580,5.09732,44.1161
2020-1214576,2020-04-17,000001,Vente,8000,,,LA JARDINE,B036,84330,84030,Caromb,84,,,840300000E0680,,,,,,,,,,,,,0,,,,,VE,vergers,,,2065,5.097422,44.116318
2020-1214636,2020-06-11,000001,Vente,30000,75,,GR GRAND RUE,0309,84330,84030,Caromb,84,,,840300000F0301,,,,,,,,,,,,,0,1,Maison,40,2,S,sols,,,28,5.10745,44.111397
2020-1214661,2020-05-20,000001,Vente,123000,274,,RUE DE LA BAISSE,0075,84330,84030,Caromb,84,,,840300000F0530,,,,,,,,,,,,,0,1,Maison,42,3,S,sols,,,100,5.109337,44.110551
2020-1214731,2020-05-28,000001,Vente,1260,,,LE BOIS,B006,84330,84030,Caromb,84,,,840300000C0263,,,,,,,,,,,,,0,,,,,B,bois,,,2120,5.117875,44.088695
2020-1214731,2020-05-28,000001,Vente,1260,,,LE BOIS,B006,84330,84030,Caromb,84,,,840300000C0916,,,,,,,,,,,,,0,,,,,T,terres,,,400,5.118784,44.088662
2020-1214746,2020-05-11,000001,Vente,35000,,,PLAN DE CANNE,B058,84330,84030,Caromb,84,,,840300000B0468,,,,,,,,,,,,,0,,,,,VI,vignes,,,3820,5.109006,44.100756
2020-1214746,2020-05-11,000001,Vente,35000,,,PLAN DE CANNE,B058,84330,84030,Caromb,84,,,840300000B0469,,,,,,,,,,,,,0,,,,,VI,vignes,,,2990,5.108811,44.100361
2020-1214746,2020-05-11,000001,Vente,35000,,,PLAN DE CANNE,B058,84330,84030,Caromb,84,,,840300000B0480,,,,,,,,,,,,,0,,,,,VI,vignes,,,1075,5.10919,44.099486
2020-1214746,2020-05-11,000001,Vente,35000,,,PLAN DE CANNE,B058,84330,84030,Caromb,84,,,840300000B0481,,,,,,,,,,,,,0,,,,,VI,vignes,,,1730,5.109508,44.09956
2020-1214746,2020-05-11,000001,Vente,35000,,,PLAN DE CANNE,B058,84330,84030,Caromb,84,,,840300000B0482,,,,,,,,,,,,,0,,,,,VI,vignes,,,5025,5.109758,44.100165
2020-1214746,2020-05-11,000001,Vente,35000,,,PLAN DE CANNE,B058,84330,84030,Caromb,84,,,840300000B0487,,,,,,,,,,,,,0,,,,,VI,vignes,,,1865,5.111269,44.099745
2020-1214746,2020-05-11,000001,Vente,35000,,,PLAN DE CANNE,B058,84330,84030,Caromb,84,,,840300000B0488,,,,,,,,,,,,,0,,,,,VI,vignes,,,965,5.11167,44.099723
2020-1214746,2020-05-11,000001,Vente,35000,,,PREYAUTS,B063,84330,84030,Caromb,84,,,840300000B0562,,,,,,,,,,,,,0,,,,,VI,vignes,,,3245,5.109051,44.101107
2020-1214777,2020-05-27,000001,Vente,60000,281,,CRS DE LA REPUBLIQUE,0052,84330,84030,Caromb,84,,,840300000F0072,,,11,34.23,,,,,,,,,1,2,Appartement,35,2,,,,,,5.106664,44.111744
2020-1214929,2020-06-09,000001,Vente,2640,,,LA JARDINE,B036,84330,84030,Caromb,84,,,840300000E0739,,,,,,,,,,,,,0,,,,,VE,vergers,,,880,5.098074,44.120595
2020-1214931,2020-06-09,000001,Vente,500,,,VILLE NEUVE,B076,84330,84030,Caromb,84,,,840300000E0073,,,,,,,,,,,,,0,,,,,VE,vergers,,,410,5.103549,44.11703
2020-1215071,2020-06-10,000001,Vente,3700,,,LA COMBE,B021,84330,84030,Caromb,84,,,840300000C0449,,,,,,,,,,,,,0,,,,,VI,vignes,,,3680,5.104198,44.090188
2020-1215073,2020-06-12,000002,Vente,2618,,,SAINT AMBROISE,B065,84330,84030,Caromb,84,,,840300000B2015,,,,,,,,,,,,,0,,,,,S,sols,,,154,5.104077,44.09814
2020-1215074,2020-06-15,000001,Vente,2000,,,ESCOUR DE FOUQUIER,B027,84330,84030,Caromb,84,,,840300000E1399,,,,,,,,,,,,,0,,,,,T,terres,,,2060,5.096072,44.123711
2020-1215074,2020-06-15,000001,Vente,2000,,,ESCOUR DE FOUQUIER,B027,84330,84030,Caromb,84,,,840300000E1400,,,,,,,,,,,,,0,,,,,L,landes,,,975,5.096282,44.123698
2020-1215074,2020-06-15,000001,Vente,2000,,,ESCOUR DE FOUQUIER,B027,84330,84030,Caromb,84,,,840300000E1401,,,,,,,,,,,,,0,,,,,P,prés,,,1140,5.096483,44.123579
2020-1215116,2020-06-19,000001,Vente,258850,5622,F,RUE DES 4 COINS,0665,84330,84030,Caromb,84,,,840300000F1163,,,,,,,,,,,,,0,2,Appartement,30,0,S,sols,,,30,5.108568,44.111049
2020-1215116,2020-06-19,000001,Vente,258850,5622,F,RUE DES 4 COINS,0665,84330,84030,Caromb,84,,,840300000F1163,,,,,,,,,,,,,0,3,Dépendance,,0,S,sols,,,30,5.108568,44.111049
2020-1215116,2020-06-19,000001,Vente,258850,5622,F,RUE DES 4 COINS,0665,84330,84030,Caromb,84,,,840300000F1163,,,,,,,,,,,,,0,3,Dépendance,,0,S,sols,,,30,5.108568,44.111049
2020-1215116,2020-06-19,000001,Vente,258850,5622,F,RUE DES 4 COINS,0665,84330,84030,Caromb,84,,,840300000F1164,,4,,,,,,,,,,,0,,,,,,,,,,5.108636,44.111064
2020-1215116,2020-06-19,000001,Vente,258850,,,RUE DES 4 COINS,0665,84330,84030,Caromb,84,,,840300000F1165,,,,,,,,,,,,,0,,,,,S,sols,,,2,5.108606,44.11108
2020-1215116,2020-06-19,000001,Vente,258850,26,,RUE DES FOURS,0232,84330,84030,Caromb,84,,,840300000F1167,,2,,,,,,,,,,,0,,,,,,,,,,5.108587,44.111106
2020-1215239,2020-07-10,000001,Vente,239000,71,,CHE SAINT ETIENNE,0682,84330,84030,Caromb,84,,,840300000A1897,,,,,,,,,,,,,0,4,Local industriel. commercial ou assimilé,45,0,S,sols,,,566,5.109116,44.119366
2020-1215239,2020-07-10,000001,Vente,239000,71,,CHE SAINT ETIENNE,0682,84330,84030,Caromb,84,,,840300000A1897,,,,,,,,,,,,,0,1,Maison,62,4,S,sols,,,566,5.109116,44.119366
2020-1215251,2020-06-30,000001,Vente,320000,,,LES PRES,B062,84330,84030,Caromb,84,,,840300000B1365,,,,,,,,,,,,,0,,,,,S,sols,,,310,5.10846,44.106447
2020-1215251,2020-06-30,000001,Vente,320000,19,,IMP DES GREFFEURS,0317,84330,84030,Caromb,84,,,840300000B1366,,,,,,,,,,,,,0,3,Dépendance,,0,P,prés,,,438,5.107878,44.10671
2020-1215251,2020-06-30,000001,Vente,320000,19,,IMP DES GREFFEURS,0317,84330,84030,Caromb,84,,,840300000B1366,,,,,,,,,,,,,0,1,Maison,110,3,P,prés,,,438,5.107878,44.10671
2020-1215251,2020-06-30,000001,Vente,320000,19,,IMP DES GREFFEURS,0317,84330,84030,Caromb,84,,,840300000B1366,,,,,,,,,,,,,0,1,Maison,110,3,S,sols,,,500,5.107878,44.10671
2020-1215251,2020-06-30,000001,Vente,320000,19,,IMP DES GREFFEURS,0317,84330,84030,Caromb,84,,,840300000B1366,,,,,,,,,,,,,0,3,Dépendance,,0,S,sols,,,500,5.107878,44.10671
2020-1215251,2020-06-30,000001,Vente,320000,,,LES PRES,B062,84330,84030,Caromb,84,,,840300000B1368,,,,,,,,,,,,,0,,,,,S,sols,,,242,5.108097,44.106631
2020-1215260,2020-06-29,000001,Vente,222600,,,SAINT ETIENNE,B067,84330,84030,Caromb,84,,,840300000A1810,,,,,,,,,,,,,0,,,,,S,sols,,,652,5.109147,44.1203
2020-1215260,2020-06-29,000001,Vente,222600,956,,AV CHARLES DE GAULLE,0117,84330,84030,Caromb,84,,,840300000A1811,,,,,,,,,,,,,0,1,Maison,80,4,S,sols,,,338,5.10915,44.120358
2020-1215370,2020-06-26,000001,Vente,20000,168,,RUE DE LA BAISSE,0075,84330,84030,Caromb,84,,,840300000F0150,,,,,,,,,,,,,0,1,Maison,30,2,S,sols,,,22,5.108437,44.109874
2020-1215439,2020-07-17,000001,Vente,191250,73,,RUE DE LA MIRANDE,0341,84330,84030,Caromb,84,,,840300000F0175,,,,,,,,,,,,,0,1,Maison,36,1,S,sols,,,82,5.107879,44.10998
2020-1215439,2020-07-17,000001,Vente,191250,73,,RUE DE LA MIRANDE,0341,84330,84030,Caromb,84,,,840300000F0175,,,,,,,,,,,,,0,1,Maison,82,4,S,sols,,,82,5.107879,44.10998
2020-1215439,2020-07-17,000001,Vente,191250,5459,,RUE DES ESTOURDOULES,0192,84330,84030,Caromb,84,,,840300000F0176,,,2,,,,,,,,,,1,3,Dépendance,,0,,,,,,5.107766,44.11003
2020-1215441,2020-07-13,000001,Vente,5505,,,CHAMPERDU,B011,84330,84030,Caromb,84,,,840300000D0069,,,,,,,,,,,,,0,,,,,T,terres,,,792,5.086686,44.111819
2020-1215441,2020-07-13,000001,Vente,5505,,,CHAMPERDU,B011,84330,84030,Caromb,84,,,840300000D0069,,,,,,,,,,,,,0,,,,,VI,vignes,,,2878,5.086686,44.111819
2020-1215488,2020-07-09,000001,Vente,14000,,,CLOS DE GARAUD,B019,84330,84030,Caromb,84,,,840300000D0436,,,,,,,,,,,,,0,,,,,VI,vignes,,,4970,5.081798,44.104355
2020-1215521,2020-07-21,000001,Vente,19983.5,,,LANSAS,B038,84330,84030,Caromb,84,,,840300000C0559,,,,,,,,,,,,,0,,,,,VI,vignes,,,2405,5.09346,44.092571
2020-1215521,2020-07-21,000001,Vente,19983.5,,,LANSAS,B038,84330,84030,Caromb,84,,,840300000C0572,,,,,,,,,,,,,0,,,,,VI,vignes,,,2725,5.09282,44.092827
2020-1215521,2020-07-21,000001,Vente,19983.5,,,LANSAS,B038,84330,84030,Caromb,84,,,840300000C0573,,,,,,,,,,,,,0,,,,,VI,vignes,,,6625,5.092997,44.093222
2020-1215573,2020-07-21,000001,Vente,15000,6458,,LE VILLAGE,B075,84330,84030,Caromb,84,,,840300000F1010,,,,,,,,,,,,,0,3,Dépendance,,0,S,sols,,,18,5.10902,44.110473
2020-1215599,2020-07-30,000002,Vente,110000,,,GARDETTE,B033,84330,84030,Caromb,84,,,840300000A1707,,,,,,,,,,,,,0,,,,,VI,vignes,,,64,5.110326,44.116807
2020-1215599,2020-07-30,000002,Vente,110000,238,,CHE DU BOUQUIER,0115,84330,84030,Caromb,84,,,840300000A1845,,,1,,,,,,,,,,1,2,Appartement,48,2,,,,,,5.110245,44.116724
2020-1215599,2020-07-30,000002,Vente,110000,,,CHE DU BOUQUIER,0115,84330,84030,Caromb,84,,,840300000A1847,,,,,,,,,,,,,0,,,,,S,sols,,,147,5.110255,44.116817
2020-1215599,2020-07-30,000002,Vente,110000,,,GARDETTE,B033,84330,84030,Caromb,84,,,840300000A1940,,,,,,,,,,,,,0,,,,,VI,vignes,,,306,5.110386,44.116839
2020-1215601,2020-07-30,000001,Vente,210000,555,A,CHE DE L ARINIER,0056,84330,84030,Caromb,84,,,840300000E1847,,,,,,,,,,,,,0,2,Appartement,92,4,S,sols,,,580,5.106826,44.116939
2020-1215601,2020-07-30,000001,Vente,210000,555,A,CHE DE L ARINIER,0056,84330,84030,Caromb,84,,,840300000E1847,,,,,,,,,,,,,0,3,Dépendance,,0,S,sols,,,580,5.106826,44.116939