id_mutation,date_mutation,numero_disposition,nature_mutation,valeur_fonciere,adresse_numero,adresse_suffixe,adresse_nom_voie,adresse_code_voie,code_postal,code_commune,nom_commune,code_departement,ancien_code_commune,ancien_nom_commune,id_parcelle,ancien_id_parcelle,numero_volume,lot1_numero,lot1_surface_carrez,lot2_numero,lot2_surface_carrez,lot3_numero,lot3_surface_carrez,lot4_numero,lot4_surface_carrez,lot5_numero,lot5_surface_carrez,nombre_lots,code_type_local,type_local,surface_reelle_bati,nombre_pieces_principales,code_nature_culture,nature_culture,code_nature_culture_speciale,nature_culture_speciale,surface_terrain,longitude,latitude
2020-1218638,2020-07-08,000001,Vente,205000,,,PELIBOUX,B049,84240,84133,La Tour-d'Aigues,84,,,841330000G0356,,,,,,,,,,,,,0,,,,,S,sols,,,130,5.53729,43.731989
2020-1218638,2020-07-08,000001,Vente,205000,143,,RTE D ANSOUIS,0033,84240,84133,La Tour-d'Aigues,84,,,841330000G0933,,,,,,,,,,,,,0,1,Maison,141,4,S,sols,,,1000,5.537433,43.732004
2020-1218638,2020-07-08,000001,Vente,205000,143,,RTE D ANSOUIS,0033,84240,84133,La Tour-d'Aigues,84,,,841330000G0933,,,,,,,,,,,,,0,3,Dépendance,,0,S,sols,,,1000,5.537433,43.732004
2020-1218638,2020-07-08,000001,Vente,205000,143,,RTE D ANSOUIS,0033,84240,84133,La Tour-d'Aigues,84,,,841330000G0933,,,,,,,,,,,,,0,3,Dépendance,,0,L,landes,,,3898,5.537433,43.732004
2020-1218638,2020-07-08,000001,Vente,205000,143,,RTE D ANSOUIS,0033,84240,84133,La Tour-d'Aigues,84,,,841330000G0933,,,,,,,,,,,,,0,1,Maison,141,4,L,landes,,,3898,5.537433,43.732004
2020-1218708,2020-01-10,000001,Vente,150000,126,,RUE JEAN MOULIN,0435,84240,84133,La Tour-d'Aigues,84,,,841330000H0933,,,,,,,,,,,,,0,1,Maison,85,3,S,sols,,,500,5.547953,43.727211
2020-1218780,2020-01-20,000001,Vente,32000,,,LE REVES,B071,84240,84133,La Tour-d'Aigues,84,,,841330000B0681,,,,,,,,,,,,,0,,,,,VI,vignes,,,7250,5.55996,43.742576
2020-1218780,2020-01-20,000001,Vente,32000,,,LE REVES,B071,84240,84133,La Tour-d'Aigues,84,,,841330000B0683,,,,,,,,,,,,,0,,,,,VI,vignes,,,4435,5.561775,43.743195
2020-1218780,2020-01-20,000001,Vente,32000,,,LE REVES,B071,84240,84133,La Tour-d'Aigues,84,,,841330000B0684,,,,,,,,,,,,,0,,,,,B,bois,,,810,5.562435,43.743493
2020-1218780,2020-01-20,000001,Vente,32000,,,LE REVES,B071,84240,84133,La Tour-d'Aigues,84,,,841330000B0687,,,,,,,,,,,,,0,,,,,VI,vignes,,,6785,5.559715,43.742812
2020-1218816,2020-01-21,000001,Vente,288000,,,LA FERRAGE,B029,84240,84133,La Tour-d'Aigues,84,,,841330000F1558,,,,,,,,,,,,,0,,,,,S,sols,,,657,5.550379,43.721719
2020-1218816,2020-01-21,000001,Vente,288000,6486,,CHE DE VERDACHE,0127,84240,84133,La Tour-d'Aigues,84,,,841330000F1620,,,,,,,,,,,,,0,1,Maison,63,3,S,sols,,,534,5.550487,43.721195
2020-1218816,2020-01-21,000001,Vente,288000,6486,,CHE DE VERDACHE,0127,84240,84133,La Tour-d'Aigues,84,,,841330000F1620,,,,,,,,,,,,,0,1,Maison,63,3,VI,vignes,,,500,5.550487,43.721195
2020-1218857,2020-02-04,000001,Vente,261333,704,,RTE DE SAINT MARTIN,0813,84240,84133,La Tour-d'Aigues,84,,,841330000B0088,,,,,,,,,,,,,0,3,Dépendance,,0,S,sols,,,1120,5.554396,43.740439
2020-1218857,2020-02-04,000001,Vente,261333,704,,RTE DE SAINT MARTIN,0813,84240,84133,La Tour-d'Aigues,84,,,841330000B0088,,,,,,,,,,,,,0,3,Dépendance,,0,S,sols,,,1120,5.554396,43.740439
2020-1218857,2020-02-04,000001,Vente,261333,704,,RTE DE SAINT MARTIN,0813,84240,84133,La Tour-d'Aigues,84,,,841330000B0088,,,,,,,,,,,,,0,3,Dépendance,,0,S,sols,,,1120,5.554396,43.740439
2020-1218857,2020-02-04,000001,Vente,261333,704,,RTE DE SAINT MARTIN,0813,84240,84133,La Tour-d'Aigues,84,,,841330000B0088,,,,,,,,,,,,,0,2,Appartement,180,6,S,sols,,,1120,5.554396,43.740439
2020-1218857,2020-02-04,000001,Vente,261333,704,,RTE DE SAINT MARTIN,0813,84240,84133,La Tour-d'Aigues,84,,,841330000B0088,,,,,,,,,,,,,0,2,Appartement,40,1,S,sols,,,1120,5.554396,43.740439
2020-1218857,2020-02-04,000001,Vente,261333,704,,RTE DE SAINT MARTIN,0813,84240,84133,La Tour-d'Aigues,84,,,841330000B0088,,,,,,,,,,,,,0,3,Dépendance,,0,S,sols,,,1120,5.554396,43.740439
2020-1218857,2020-02-04,000001,Vente,261333,704,,RTE DE SAINT MARTIN,0813,84240,84133,La Tour-d'Aigues,84,,,841330000B1369,,,,,,,,,,,,,0,,,,,VI,vignes,,,3880,5.554408,43.740406
2020-1218869,2020-01-28,000001,Vente,460000,6054,,LA BOURGUETTE,B011,84240,84133,La Tour-d'Aigues,84,,,841330000D0709,,,,,,,,,,,,,0,1,Maison,124,5,T,terres,,,1000,5.577842,43.728003
2020-1218869,2020-01-28,000001,Vente,460000,6054,,LA BOURGUETTE,B011,84240,84133,La Tour-d'Aigues,84,,,841330000D0709,,,,,,,,,,,,,0,1,Maison,124,5,S,sols,,,725,5.577842,43.728003
2020-1218869,2020-01-28,000001,Vente,460000,6054,,LA BOURGUETTE,B011,84240,84133,La Tour-d'Aigues,84,,,841330000D0709,,,,,,,,,,,,,0,3,Dépendance,,0,T,terres,,,1000,5.577842,43.728003
2020-1218869,2020-01-28,000001,Vente,460000,6054,,LA BOURGUETTE,B011,84240,84133,La Tour-d'Aigues,84,,,841330000D0709,,,,,,,,,,,,,0,3,Dépendance,,0,S,sols,,,725,5.577842,43.728003
2020-1218869,2020-01-28,000001,Vente,460000,,,LA BOURGUETTE,B011,84240,84133,La Tour-d'Aigues,84,,,841330000D0749,,,,,,,,,,,,,0,,,,,S,sols,,,42,5.580438,43.726656
2020-1218869,2020-01-28,000001,Vente,460000,,,LA BOURGUETTE,B011,84240,84133,La Tour-d'Aigues,84,,,841330000D0860,,,,,,,,,,,,,0,,,,,S,sols,,,26,5.575095,43.727659
2020-1218869,2020-01-28,000001,Vente,460000,,,LA BOURGUETTE,B011,84240,84133,La Tour-d'Aigues,84,,,841330000D1078,,,,,,,,,,,,,0,,,,,S,sols,,,271,5.576807,43.728022
2020-1218869,2020-01-28,000001,Vente,460000,,,LA BOURGUETTE,B011,84240,84133,La Tour-d'Aigues,84,,,841330000D1079,,,,,,,,,,,,,0,,,,,S,sols,,,118,5.577129,43.728415
2020-1218869,2020-01-28,000001,Vente,460000,,,LA BOURGUETTE,B011,84240,84133,La Tour-d'Aigues,84,,,841330000D1080,,,,,,,,,,,,,0,,,,,S,sols,,,5446,5.579946,43.726159
2020-1218869,2020-01-28,000001,Vente,460000,,,LA BOURGUETTE,B011,84240,84133,La Tour-d'Aigues,84,,,841330000D1081,,,,,,,,,,,,,0,,,,,S,sols,,,25,5.581263,43.725351
2020-1218869,2020-01-28,000001,Vente,460000,,,LA BOURGUETTE,B011,84240,84133,La Tour-d'Aigues,84,,,841330000D1082,,,,,,,,,,,,,0,,,,,S,sols,,,1490,5.579982,43.725818
2020-1218869,2020-01-28,000001,Vente,460000,,,LA BOURGUETTE,B011,84240,84133,La Tour-d'Aigues,84,,,841330000D1084,,,,,,,,,,,,,0,,,,,S,sols,,,406,5.580487,43.726709
2020-1218869,2020-01-28,000001,Vente,460000,,,LA BOURGUETTE,B011,84240,84133,La Tour-d'Aigues,84,,,841330000D1085,,,,,,,,,,,,,0,,,,,S,sols,,,34,5.581307,43.725497
2020-1218869,2020-01-28,000001,Vente,460000,,,LA BOURGUETTE,B011,84240,84133,La Tour-d'Aigues,84,,,841330000D1086,,,,,,,,,,,,,0,,,,,S,sols,,,406,5.576396,43.727588
2020-1218869,2020-01-28,000001,Vente,460000,,,LA BOURGUETTE,B011,84240,84133,La Tour-d'Aigues,84,,,841330000D1087,,,,,,,,,,,,,0,,,,,S,sols,,,32,5.575668,43.727524
2020-1218869,2020-01-28,000001,Vente,460000,,,LA BOURGUETTE,B011,84240,84133,La Tour-d'Aigues,84,,,841330000D1088,,,,,,,,,,,,,0,,,,,S,sols,,,542,5.575925,43.72765
2020-1218869,2020-01-28,000001,Vente,460000,,,LA BOURGUETTE,B011,84240,84133,La Tour-d'Aigues,84,,,841330000D1090,,,,,,,,,,,,,0,,,,,S,sols,,,28,5.575507,43.727542
2020-1218988,2020-01-29,000001,Vente,140000,51,,RUE LAFAYETTE,0490,84240,84133,La Tour-d'Aigues,84,,,841330000H0428,,,1,,,,,,,,,,1,3,Dépendance,,0,,,,,,5.548892,43.725237
2020-1218988,2020-01-29,000001,Vente,140000,51,,RUE LAFAYETTE,0490,84240,84133,La Tour-d'Aigues,84,,,841330000H0429,,,,,,,,,,,,,0,1,Maison,90,4,S,sols,,,37,5.548938,43.725233
2020-1219099,2020-02-14,000001,Vente,111000,21,,RUE DU PONT DE L'EZE,0703,84240,84133,La Tour-d'Aigues,84,,,841330000H0505,,,,,,,,,,,,,0,1,Maison,70,4,S,sols,,,76,5.54835,43.724585
2020-1219160,2020-02-26,000001,Vente,119000,69,,RUE DU PUITS,0712,84240,84133,La Tour-d'Aigues,84,,,841330000H0658,,,,,,,,,,,,,0,1,Maison,90,3,S,sols,,,45,5.547197,43.72456
2020-1219236,2020-02-28,000001,Vente,340000,6272,,LA BOURGUETTE,B011,84240,84133,La Tour-d'Aigues,84,,,841330000D0725,,,,,,,,,,,,,0,1,Maison,99,3,S,sols,,,1000,5.579267,43.726861
2020-1219236,2020-02-28,000001,Vente,340000,6272,,LA BOURGUETTE,B011,84240,84133,La Tour-d'Aigues,84,,,841330000D0725,,,,,,,,,,,,,0,1,Maison,99,3,VI,vignes,,,856,5.579267,43.726861
2020-1219307,2020-02-14,000001,Vente,22000,,,LE PAROIR,B047,84240,84133,La Tour-d'Aigues,84,,,841330000A0657,,,,,,,,,,,,,0,,,,,J,jardins,,,360,5.543419,43.730161
2020-1219307,2020-02-14,000001,Vente,22000,6488,,LE PAROIR,B047,84240,84133,La Tour-d'Aigues,84,,,841330000A0848,,,,,,,,,,,,,0,3,Dépendance,,0,S,sols,,,10,5.543451,43.730172
2020-1219414,2020-02-24,000001,Vente,105000,5175,,RUE DE LA CHAPELLE,0126,84240,84133,La Tour-d'Aigues,84,,,841330000H0279,,,7,,9,,,,,,,,2,2,Appartement,58,2,,,,,,5.549317,43.725471
2020-1219472,2020-03-10,000001,Vente,240000,,,LE PARC,B046,84240,84133,La Tour-d'Aigues,84,,,841330000B1436,,,,,,,,,,,,,0,,,,,S,sols,,,726,5.554775,43.735031
2020-1219472,2020-03-10,000001,Vente,240000,,,LE PARC,B046,84240,84133,La Tour-d'Aigues,84,,,841330000B1441,,,,,,,,,,,,,0,,,,,S,sols,,,4,5.554756,43.735354
2020-1219472,2020-03-10,000001,Vente,240000,6530,F,LE PARC,B046,84240,84133,La Tour-d'Aigues,84,,,841330000B1626,,,,,,,,,,,,,0,1,Maison,199,7,T,terres,,,696,5.555223,43.734647
2020-1219472,2020-03-10,000001,Vente,240000,6530,F,LE PARC,B046,84240,84133,La Tour-d'Aigues,84,,,841330000B1626,,,,,,,,,,,,,0,1,Maison,199,7,S,sols,,,1000,5.555223,43.734647
2020-1219527,2020-03-24,000001,Vente,358000,27,,LOT LES PRES NEUFS,A050,84240,84133,La Tour-d'Aigues,84,,,841330000B1183,,,,,,,,,,,,,0,1,Maison,132,5,S,sols,,,488,5.546839,43.732957
2020-1219527,2020-03-24,000001,Vente,358000,,,LES PRES NEUFS,B066,84240,84133,La Tour-d'Aigues,84,,,841330000B1743,,,,,,,,,,,,,0,,,,,S,sols,,,245,5.547606,43.734111
2020-1219527,2020-03-24,000001,Vente,358000,,,LES PRES NEUFS,B066,84240,84133,La Tour-d'Aigues,84,,,841330000B1744,,,,,,,,,,,,,0,,,,,S,sols,,,442,5.546288,43.733553
2020-1219527,2020-03-24,000001,Vente,358000,,,LES PRES NEUFS,B066,84240,84133,La Tour-d'Aigues,84,,,841330000B1745,,,,,,,,,,,,,0,,,,,S,sols,,,663,5.547076,43.733372
2020-1219527,2020-03-24,000001,Vente,358000,,,LES PRES NEUFS,B066,84240,84133,La Tour-d'Aigues,84,,,841330000B1746,,,,,,,,,,,,,0,,,,,S,sols,,,64,5.54723,43.732663
2020-1219527,2020-03-24,000001,Vente,358000,,,LES PRES NEUFS,B066,84240,84133,La Tour-d'Aigues,84,,,841330000B1747,,,,,,,,,,,,,0,,,,,S,sols,,,537,5.546761,43.733242
2020-1219527,2020-03-24,000001,Vente,358000,,,LES PRES NEUFS,B066,84240,84133,La Tour-d'Aigues,84,,,841330000B1749,,,,,,,,,,,,,0,,,,,S,sols,,,111,5.54806,43.734197
2020-1219527,2020-03-24,000001,Vente,358000,,,LES PRES NEUFS,B066,84240,84133,La Tour-d'Aigues,84,,,841330000B1750,,,,,,,,,,,,,0,,,,,S,sols,,,55,5.54788,43.734184
2020-1219540,2020-04-09,000001,Vente,473900,601,,CHE DES LIMITES,0498,84240,84133,La Tour-d'Aigues,84,,,841330000C0670,,,,,,,,,,,,,0,1,Maison,132,5,S,sols,,,680,,
2020-1219540,2020-04-09,000001,Vente,473900,601,,CHE DES LIMITES,0498,84240,84133,La Tour-d'Aigues,84,,,841330000C0670,,,,,,,,,,,,,0,1,Maison,132,5,B,bois,,,22000,,
2020-1219540,2020-04-09,000001,Vente,473900,,,LA TURQUERIE,B089,84240,84133,La Tour-d'Aigues,84,,,841330000C1100,,,,,,,,,,,,,0,,,,,T,terres,,,8187,,
2020-1219552,2020-04-27,000001,Vente,105000,5327,,RUE DE LA BRECHE,0091,84240,84133,La Tour-d'Aigues,84,,,841330000H0457,,,2,,,,,,,,,,1,2,Appartement,45,2,,,,,,5.549189,43.72488
2020-1219567,2020-04-06,000001,Vente,11000,,,PIVOURIER,B054,84240,84133,La Tour-d'Aigues,84,,,841330000F0379,,,,,,,,,,,,,0,,,,,VI,vignes,,,6140,5.550115,43.710274
2020-1219567,2020-04-06,000001,Vente,11000,,,PIVOURIER,B054,84240,84133,La Tour-d'Aigues,84,,,841330000F0380,,,,,,,,,,,,,0,,,,,S,sols,,,25,5.550029,43.710207
2020-1219576,2020-03-05,000001,Vente,40000,250,,RUE DU DOC MEDVEDOWSKY,0177,84240,84133,La Tour-d'Aigues,84,,,841330000H0810,,,3,62.75,,,,,,,,,1,2,Appartement,53,3,,,,,,5.546497,43.72368
2020-1219794,2020-05-04,000001,Vente,65000,100,,RUE DU PUITS,0712,84240,84133,La Tour-d'Aigues,84,,,841330000H0665,,,5,,,,,,,,,,1,2,Appartement,61,4,,,,,,5.547072,43.724194
2020-1219798,2020-05-18,000001,Vente,277000,7,,RUE ANTOINE DE TRES,0038,84240,84133,La Tour-d'Aigues,84,,,841330000H0374,,,,,,,,,,,,,0,3,Dépendance,,0,S,sols,,,58,5.547655,43.725796
2020-1219798,2020-05-18,000001,Vente,277000,7,,RUE ANTOINE DE TRES,0038,84240,84133,La Tour-d'Aigues,84,,,841330000H0374,,,,,,,,,,,,,0,3,Dépendance,,0,S,sols,,,58,5.547655,43.725796
2020-1219798,2020-05-18,000001,Vente,277000,7,,RUE ANTOINE DE TRES,0038,84240,84133,La Tour-d'Aigues,84,,,841330000H0374,,,,,,,,,,,,,0,3,Dépendance,,0,S,sols,,,58,5.547655,43.725796
2020-1219798,2020-05-18,000001,Vente,277000,7,,RUE ANTOINE DE TRES,0038,84240,84133,La Tour-d'Aigues,84,,,841330000H0374,,,,,,,,,,,,,0,3,Dépendance,,0,S,sols,,,58,5.547655,43.725796
2020-1219798,2020-05-18,000001,Vente,277000,7,,RUE ANTOINE DE TRES,0038,84240,84133,La Tour-d'Aigues,84,,,841330000H0374,,,,,,,,,,,,,0,2,Appartement,69,2,S,sols,,,58,5.547655,43.725796
2020-1219798,2020-05-18,000001,Vente,277000,7,,RUE ANTOINE DE TRES,0038,84240,84133,La Tour-d'Aigues,84,,,841330000H0374,,,,,,,,,,,,,0,3,Dépendance,,0,S,sols,,,58,5.547655,43.725796
2020-1219798,2020-05-18,000001,Vente,277000,7,,RUE ANTOINE DE TRES,0038,84240,84133,La Tour-d'Aigues,84,,,841330000H0374,,,,,,,,,,,,,0,3,Dépendance,,0,S,sols,,,58,5.547655,43.725796
2020-1219798,2020-05-18,000001,Vente,277000,7,,RUE ANTOINE DE TRES,0038,84240,84133,La Tour-d'Aigues,84,,,841330000H0374,,,,,,,,,,,,,0,2,Appartement,81,3,S,sols,,,58,5.547655,43.725796
2020-1219798,2020-05-18,000001,Vente,277000,7,,RUE ANTOINE DE TRES,0038,84240,84133,La Tour-d'Aigues,84,,,841330000H0374,,,,,,,,,,,,,0,4,Local industriel. commercial ou assimilé,108,0,S,sols,,,58,5.547655,43.725796
2020-1219798,2020-05-18,000001,Vente,277000,,,LE VILLAGE,B093,84240,84133,La Tour-d'Aigues,84,,,841330000H0375,,,,,,,,,,,,,0,,,,,S,sols,,,65,5.547619,43.725849
2020-1219808,2020-05-22,000001,Vente,100000,,,LES MOLIERES,B042,84240,84133,La Tour-d'Aigues,84,,,841330000A0163,,,,,,,,,,,,,0,,,,,S,sols,,,15,5.536583,43.735832
2020-1219808,2020-05-22,000001,Vente,100000,,,LES MOLIERES,B042,84240,84133,La Tour-d'Aigues,84,,,841330000A0920,,,,,,,,,,,,,0,,,,,VI,vignes,,,2509,5.53647,43.735769
2020-1219808,2020-05-22,000001,Vente,100000,,,LES MOLIERES,B042,84240,84133,La Tour-d'Aigues,84,,,841330000A0921,,,,,,,,,,,,,0,,,,,VI,vignes,,,11829,5.535944,43.736187
2020-1219808,2020-05-22,000001,Vente,100000,,,CAYOUX,B016,84240,84133,La Tour-d'Aigues,84,,,841330000C0184,,,,,,,,,,,,,0,,,,,VI,vignes,,,3600,5.560463,43.728962
2020-1219808,2020-05-22,000001,Vente,100000,,,CAYOUX,B016,84240,84133,La Tour-d'Aigues,84,,,841330000C0184,,,,,,,,,,,,,0,,,,,VI,vignes,,,3710,5.560463,43.728962
2020-1219808,2020-05-22,000001,Vente,100000,,,CAYOUX,B016,84240,84133,La Tour-d'Aigues,84,,,841330000C0185,,,,,,,,,,,,,0,,,,,T,terres,,,1200,5.559282,43.728831
2020-1219808,2020-05-22,000001,Vente,100000,,,CAYOUX,B016,84240,84133,La Tour-d'Aigues,84,,,841330000C0185,,,,,,,,,,,,,0,,,,,VI,vignes,,,5970,5.559282,43.728831
2020-1219869,2020-05-14,000001,Vente,185650,20,,RUE DE LA RESISTANCE,0765,84240,84133,La Tour-d'Aigues,84,,,841330000H1307,,,,,,,,,,,,,0,1,Maison,80,3,S,sols,,,51,5.546482,43.724809
2020-1219935,2020-05-12,000001,Vente,97500,84,,PL DU COQ,0140,84240,84133,La Tour-d'Aigues,84,,,841330000H0594,,,,,,,,,,,,,0,1,Maison,57,2,S,sols,,,81,5.547783,43.72473
2020-1220088,2020-06-11,000001,Vente,200000,498,,CHEM DE LA SCIERIE,0814,84240,84133,La Tour-d'Aigues,84,,,841330000F1151,,,,,,,,,,,,,0,1,Maison,157,6,S,sols,,,1150,5.528848,43.710197
2020-1220088,2020-06-11,000001,Vente,200000,498,,CHEM DE LA SCIERIE,0814,84240,84133,La Tour-d'Aigues,84,,,841330000F1658,,,,,,,,,,,,,0,,,,,T,terres,,,1963,5.528444,43.709819
2020-1220088,2020-06-11,000001,Vente,200000,498,,CHEM DE LA SCIERIE,0814,84240,84133,La Tour-d'Aigues,84,,,841330000F1659,,,,,,,,,,,,,0,,,,,T,terres,,,121,5.528842,43.710385
2020-1220120,2020-05-25,000002,Vente,110000,466,,CHE DU PIEMONT,0691,84240,84133,La Tour-d'Aigues,84,,,841330000B1848,,,,,,,,,,,,,0,3,Dépendance,,0,S,sols,,,170,5.546181,43.733703
2020-1220120,2020-05-25,000002,Vente,110000,466,,CHE DU PIEMONT,0691,84240,84133,La Tour-d'Aigues,84,,,841330000B1848,,,,,,,,,,,,,0,2,Appartement,48,2,S,sols,,,170,5.546181,43.733703
2020-1220125,2020-06-19,000001,Vente,218900,44,,RUE DES TISSERANDS,0867,84240,84133,La Tour-d'Aigues,84,,,841330000H1358,,,,,,,,,,,,,0,1,Maison,125,4,S,sols,,,148,5.548238,43.724361
2020-1220139,2020-06-05,000001,Vente,9000,,,OURGOUSE,B045,84240,84133,La Tour-d'Aigues,84,,,841330000G0469,,,,,,,,,,,,,0,,,,,J,jardins,,,520,5.543426,43.724894
2020-1220139,2020-06-05,000001,Vente,9000,,,OURGOUSE,B045,84240,84133,La Tour-d'Aigues,84,,,841330000G0470,,,,,,,,,,,,,0,,,,,J,jardins,,,170,5.543625,43.724782
2020-1220139,2020-06-05,000001,Vente,9000,,,OURGOUSE,B045,84240,84133,La Tour-d'Aigues,84,,,841330000G0471,,,,,,,,,,,,,0,,,,,T,terres,,,185,5.543343,43.724833
2020-1220320,2020-07-07,000001,Vente,8000,,,SAINT VINCENT,B081,84240,84133,La Tour-d'Aigues,84,,,841330000A0323,,,,,,,,,,,,,0,,,,,VI,vignes,,,4100,5.545553,43.741227
2020-1220342,2020-06-16,000001,Vente,181500,15,,RUE DU DOC MEDVEDOWSKY,0177,84240,84133,La Tour-d'Aigues,84,,,841330000H0094,,,7,,,,,,,,,,1,2,Appartement,41,2,,,,,,5.547137,43.72577
2020-1220365,2020-06-18,000001,Vente,1,,,SAINT ROCH,B079,84240,84133,La Tour-d'Aigues,84,,,841330000G1157,,,,,,,,,,,,,0,,,,,S,sols,,,495,5.541891,43.7243
2020-1220365,2020-06-18,000001,Vente,1,,,SAINT ROCH,B079,84240,84133,La Tour-d'Aigues,84,,,841330000G1900,,,,,,,,,,,,,0,,,,,VI,vignes,,,215,5.541966,43.723671
2020-1220388,2020-06-24,000001,Vente,102000,25,,RUE ANTOINE DE TRES,0038,84240,84133,La Tour-d'Aigues,84,,,841330000H1213,,,2,59.27,,,,,,,,,1,4,Local industriel. commercial ou assimilé,70,0,,,,,,5.547654,43.725636
2020-1220439,2020-07-16,000001,Vente,70000,3,,PL DE L EGLISE,0212,84240,84133,La Tour-d'Aigues,84,,,841330000H0342,,,,,,,,,,,,,0,1,Maison,78,3,S,sols,,,59,5.548609,43.72572
2020-1220439,2020-07-16,000001,Vente,70000,3,,PL DE L EGLISE,0212,84240,84133,La Tour-d'Aigues,84,,,841330000H0342,,,,,,,,,,,,,0,4,Local industriel. commercial ou assimilé,45,0,S,sols,,,59,5.548609,43.72572
2020-1220457,2020-06-26,000001,Vente,30000,,,CAYOUX SUD,B017,84240,84133,La Tour-d'Aigues,84,,,841330000D0148,,,,,,,,,,,,,0,,,,,VI,vignes,,,3190,5.566733,43.725038
2020-1220457,2020-06-26,000001,Vente,30000,,,CAYOUX SUD,B017,84240,84133,La Tour-d'Aigues,84,,,841330000D0149,,,,,,,,,,,,,0,,,,,VI,vignes,,,11600,5.567429,43.725166
2020-1220457,2020-06-26,000001,Vente,30000,,,CAYOUX SUD,B017,84240,84133,La Tour-d'Aigues,84,,,841330000D0150,,,,,,,,,,,,,0,,,,,S,sols,,,40,5.568058,43.724612
2020-1220496,2020-07-08,000001,Vente,205000,,,PELIBOUX,B049,84240,84133,La Tour-d'Aigues,84,,,841330000G0356,,,,,,,,,,,,,0,,,,,S,sols,,,130,5.53729,43.731989
2020-1220496,2020-07-08,000001,Vente,205000,143,,RTE D ANSOUIS,0033,84240,84133,La Tour-d'Aigues,84,,,841330000G0933,,,,,,,,,,,,,0,1,Maison,88,3,L,landes,,,3898,5.537433,43.732004
2020-1220496,2020-07-08,000001,Vente,205000,143,,RTE D ANSOUIS,0033,84240,84133,La Tour-d'Aigues,84,,,841330000G0933,,,,,,,,,,,,,0,1,Maison,88,3,S,sols,,,1000,5.537433,43.732004
2020-1220514,2020-06-30,000001,Vente,472400,,,LE PARC,B046,84240,84133,La Tour-d'Aigues,84,,,841330000B1439,,,,,,,,,,,,,0,,,,,S,sols,,,62,5.554665,43.735165
2020-1220514,2020-06-30,000001,Vente,472400,6479,,LE PARC,B046,84240,84133,La Tour-d'Aigues,84,,,841330000B1440,,,,,,,,,,,,,0,1,Maison,112,4,S,sols,,,732,5.554577,43.735203
2020-1220514,2020-06-30,000001,Vente,472400,60,,TRA DU LONG MUR,0501,84240,84133,La Tour-d'Aigues,84,,,841330000B1443,,,,,,,,,,,,,0,,,,,S,sols,,,708,5.554277,43.735171
2020-1220554,2020-07-22,000001,Vente,165000,6,,PL DE L EGLISE,0212,84240,84133,La Tour-d'Aigues,84,,,841330000H0363,,,,,,,,,,,,,0,2,Appartement,32,1,S,sols,,,68,5.548407,43.72583
2020-1220554,2020-07-22,000001,Vente,165000,6,,PL DE L EGLISE,0212,84240,84133,La Tour-d'Aigues,84,,,841330000H0363,,,,,,,,,,,,,0,2,Appartement,106,3,S,sols,,,68,5.548407,43.72583
2020-1220559,2020-07-15,000001,Vente,150000,40,,BD DE LA REPUBLIQUE,0761,84240,84133,La Tour-d'Aigues,84,,,841330000H0151,,,4,,,,,,,,,,1,1,Maison,52,4,,,,,,5.548281,43.726109
2020-1220559,2020-07-15,000001,Vente,150000,40,,BD DE LA REPUBLIQUE,0761,84240,84133,La Tour-d'Aigues,84,,,841330000H0151,,,3,,,,,,,,,,1,4,Local industriel. commercial ou assimilé,29,0,,,,,,5.548281,43.726109
2020-1220565,2020-07-20,000001,Vente,24000,,,LA POURPETTE,B063,84240,84133,La Tour-d'Aigues,84,,,841330000B0895,,,,,,,,,,,,,0,,,,,VI,vignes,,,10192,5.564787,43.749142
2020-1220565,2020-07-20,000001,Vente,24000,,,LA POURPETTE,B063,84240,84133,La Tour-d'Aigues,84,,,841330000B0898,,,,,,,,,,,,,0,,,,,T,terres,,,759,5.563137,43.748478
2020-1220569,2020-07-16,000001,Vente,111100.8,,,LE PLAN SUD,B062,84240,84133,La Tour-d'Aigues,84,,,841330000G1766,,,,,,,,,,,,,0,,,,,AB,terrains a bâtir,,,2840,5.536853,43.72254
2020-1220676,2020-07-28,000001,Vente,12200,,,PIVOURIER,B054,84240,84133,La Tour-d'Aigues,84,,,841330000F0344,,,2,,,,,,,,,,1,,,,,VI,vignes,,,1350,5.549915,43.707151
2020-1220676,2020-07-28,000001,Vente,12200,,,PIVOURIER,B054,84240,84133,La Tour-d'Aigues,84,,,841330000F0344,,,1,,,,,,,,,,1,,,,,T,terres,,,4750,5.549915,43.707151
2020-1220681,2020-07-24,000001,Vente,11500,,,LE REVES SUD,B072,84240,84133,La Tour-d'Aigues,84,,,841330000B0630,,,,,,,,,,,,,0,,,,,VI,vignes,,,5050,5.567223,43.74211
2020-1220681,2020-07-24,000001,Vente,11500,,,NOTRE DAME,B044,84240,84133,La Tour-d'Aigues,84,,,841330000H0727,,,,,,,,,,,,,0,,,,,P,prés,,,2790,5.541258,43.718451
2020-1220683,2020-07-23,000001,Vente,38000,,,LES BOUISSES,B010,84240,84133,La Tour-d'Aigues,84,,,841330000F0192,,,,,,,,,,,,,0,,,,,VI,vignes,,,6130,5.547285,43.714456
2020-1220683,2020-07-23,000001,Vente,38000,,,LES BOUISSES,B010,84240,84133,La Tour-d'Aigues,84,,,841330000F0193,,,,,,,,,,,,,0,,,,,S,sols,,,15,5.547517,43.714343
2020-1220683,2020-07-23,000001,Vente,38000,,,LES BOUISSES,B010,84240,84133,La Tour-d'Aigues,84,,,841330000F0194,,,,,,,,,,,,,0,,,,,VI,vignes,,,9730,5.546951,43.71517
2020-1220683,2020-07-23,000001,Vente,38000,,,LES BOUISSES,B010,84240,84133,La Tour-d'Aigues,84,,,841330000F0200,,,,,,,,,,,,,0,,,,,VI,vignes,,,2780,5.547579,43.713789
2020-1220688,2020-07-23,000001,Vente,8000,,,LE REVES,B071,84240,84133,La Tour-d'Aigues,84,,,841330000B0374,,,,,,,,,,,,,0,,,,,VI,vignes,,,3786,5.560722,43.740773
2020-1220690,2020-07-23,000001,Vente,18000,,,LE REVES,B071,84240,84133,La Tour-d'Aigues,84,,,841330000B0685,,,,,,,,,,,,,0,,,,,B,bois,,,1040,5.562102,43.743908
2020-1220690,2020-07-23,000001,Vente,18000,,,LE REVES,B071,84240,84133,La Tour-d'Aigues,84,,,841330000B0686,,,,,,,,,,,,,0,,,,,T,terres,,,2800,5.56071,43.74342
2020-1220690,2020-07-23,000001,Vente,18000,,,LE REVES,B071,84240,84133,La Tour-d'Aigues,84,,,841330000B0686,,,,,,,,,,,,,0,,,,,VI,vignes,,,7575,5.56071,43.74342
2020-1220694,2020-07-15,000001,Vente,25185,,,POUSPEYRE,B064,84240,84133,La Tour-d'Aigues,84,,,841330000F0802,,,,,,,,,,,,,0,,,,,S,sols,,,15,5.567536,43.71309
2020-1220694,2020-07-15,000001,Vente,25185,,,POUSPEYRE,B064,84240,84133,La Tour-d'Aigues,84,,,841330000F0803,,,,,,,,,,,,,0,,,,,VI,vignes,,,8395,5.56764,43.71289
2020-1220694,2020-07-15,000001,Vente,25185,,,POUSPEYRE,B064,84240,84133,La Tour-d'Aigues,84,,,841330000F0804,,,,,,,,,,,,,0,,,,,B,bois,,,820,5.567666,43.713646
2020-1220695,2020-07-28,000001,Vente,3000,,,LES HORTS,B036,84240,84133,La Tour-d'Aigues,84,,,841330000A0361,,,,,,,,,,,,,0,,,,,J,jardins,,,1460,5.54044,43.738324
2020-1220706,2020-07-23,000001,Vente,21000,,,COLLET DE LA MULE,B020,84240,84133,La Tour-d'Aigues,84,,,841330000B1063,,,,,,,,,,,,,0,,,,,VI,vignes,,,3681,5.549943,43.747566
2020-1220706,2020-07-23,000001,Vente,21000,,,COLLET DE LA MULE,B020,84240,84133,La Tour-d'Aigues,84,,,841330000B1063,,,,,,,,,,,,,0,,,,,VI,vignes,,,3682,5.549943,43.747566
2020-1220706,2020-07-23,000001,Vente,21000,,,COLLET DE LA MULE,B020,84240,84133,La Tour-d'Aigues,84,,,841330000B1065,,,,,,,,,,,,,0,,,,,VI,vignes,,,2336,5.550152,43.748157