id_mutation,date_mutation,numero_disposition,nature_mutation,valeur_fonciere,adresse_numero,adresse_suffixe,adresse_nom_voie,adresse_code_voie,code_postal,code_commune,nom_commune,code_departement,ancien_code_commune,ancien_nom_commune,id_parcelle,ancien_id_parcelle,numero_volume,lot1_numero,lot1_surface_carrez,lot2_numero,lot2_surface_carrez,lot3_numero,lot3_surface_carrez,lot4_numero,lot4_surface_carrez,lot5_numero,lot5_surface_carrez,nombre_lots,code_type_local,type_local,surface_reelle_bati,nombre_pieces_principales,code_nature_culture,nature_culture,code_nature_culture_speciale,nature_culture_speciale,surface_terrain,longitude,latitude
2020-1232929,2020-01-24,000001,Vente,5973.38,,,LA TOURNERIE,B616,85510,85031,Le Boupère,85,,,85031000ZB0005,,,,,,,,,,,,,0,,,,,T,terres,,,23890,-0.979869,46.770604
2020-1232930,2020-01-14,000001,Vente,130000,,,LES BOURGERIES,B050,85510,85031,Le Boupère,85,,,850310000B1395,,,,,,,,,,,,,0,,,,,T,terres,,,104,-0.934171,46.794199
2020-1232930,2020-01-14,000001,Vente,130000,7,,RUE GEORGES CLEMENCEAU,0061,85510,85031,Le Boupère,85,,,850310000B1570,,,,,,,,,,,,,0,1,Maison,92,4,S,sols,,,1327,-0.934422,46.794317
2020-1232970,2020-01-27,000001,Vente,74500,12,,RUE DU MAL DE LATTRE DE TASSIG,0083,85510,85031,Le Boupère,85,,,85031000AB0086,,,,,,,,,,,,,0,1,Maison,60,3,S,sols,,,447,-0.923287,46.793149
2020-1233209,2020-02-11,000001,Vente,143000,5774,,LA FAUBRETIERE,B224,85510,85031,Le Boupère,85,,,850310000E0885,,,,,,,,,,,,,0,1,Maison,97,4,S,sols,,,1020,-0.930789,46.771887
2020-1233209,2020-02-11,000001,Vente,143000,,,LA FAUBRETIERE,B224,85510,85031,Le Boupère,85,,,850310000E0886,,,,,,,,,,,,,0,,,,,S,sols,,,42,-0.931013,46.771738
2020-1233209,2020-02-11,000001,Vente,143000,,,LA FAUBRETIERE,B224,85510,85031,Le Boupère,85,,,850310000E1629,,,,,,,,,,,,,0,,,,,S,sols,,,120,-0.930749,46.771569
2020-1233209,2020-02-11,000001,Vente,143000,5551,,LA FAUBRETIERE,B224,85510,85031,Le Boupère,85,,,850310000E1645,,,,,,,,,,,,,0,3,Dépendance,,0,S,sols,,,255,-0.930946,46.77162
2020-1233209,2020-02-11,000001,Vente,143000,,,LA FAUBRETIERE,B224,85510,85031,Le Boupère,85,,,850310000E1647,,,,,,,,,,,,,0,,,,,S,sols,,,16,-0.931069,46.771603
2020-1233248,2020-02-13,000001,Vente,60000,5394,,L HAUMONDIERE,B336,85510,85031,Le Boupère,85,,,850310000G0280,,,,,,,,,,,,,0,1,Maison,76,3,S,sols,,,34,-0.903856,46.757502
2020-1233248,2020-02-13,000001,Vente,60000,,,L HAUMONDIERE,B336,85510,85031,Le Boupère,85,,,850310000G1392,,,,,,,,,,,,,0,,,,,S,sols,,,50,-0.903785,46.757518
2020-1233248,2020-02-13,000001,Vente,60000,,,L HAUMONDIERE,B336,85510,85031,Le Boupère,85,,,850310000G1716,,,,,,,,,,,,,0,,,,,S,sols,,,90,-0.903718,46.757501
2020-1233321,2020-02-20,000002,Vente,80,,,PIFFECAUD,B455,85510,85031,Le Boupère,85,,,850310000G2027,,,,,,,,,,,,,0,,,,,P,prés,,,389,-0.910746,46.768185
2020-1233378,2020-02-27,000001,Vente,113500,18,,RUE DES VENELLES,0160,85510,85031,Le Boupère,85,,,850310000B2422,,,,,,,,,,,,,0,4,Local industriel. commercial ou assimilé,,0,J,jardins,,,341,-0.927063,46.797737
2020-1233378,2020-02-27,000001,Vente,113500,18,,RUE DES VENELLES,0160,85510,85031,Le Boupère,85,,,850310000B2422,,,,,,,,,,,,,0,4,Local industriel. commercial ou assimilé,,0,S,sols,,,201,-0.927063,46.797737
2020-1233378,2020-02-27,000001,Vente,113500,18,,RUE DES VENELLES,0160,85510,85031,Le Boupère,85,,,850310000B2422,,,,,,,,,,,,,0,1,Maison,94,6,S,sols,,,201,-0.927063,46.797737
2020-1233378,2020-02-27,000001,Vente,113500,18,,RUE DES VENELLES,0160,85510,85031,Le Boupère,85,,,850310000B2422,,,,,,,,,,,,,0,1,Maison,94,6,J,jardins,,,341,-0.927063,46.797737
2020-1233435,2020-02-27,000001,Vente,135000,16,,CITE ST NICOLAS,A103,85510,85031,Le Boupère,85,,,850310000B1432,,,,,,,,,,,,,0,1,Maison,105,4,S,sols,,,644,-0.928915,46.797556
2020-1233437,2020-02-26,000001,Vente,2067,,,LE BOURG,B049,85510,85031,Le Boupère,85,,,85031000AB0464,,,,,,,,,,,,,0,,,,,J,jardins,,,159,-0.926488,46.796644
2020-1233439,2020-03-02,000001,Vente,90000,17,,CITE TREILBOURG,A110,85510,85031,Le Boupère,85,,,850310000B1373,,,,,,,,,,,,,0,1,Maison,88,5,S,sols,,,440,-0.929676,46.797316
2020-1233439,2020-03-02,000001,Vente,90000,,,LE HAUT TREILBOURG,B337,85510,85031,Le Boupère,85,,,850310000B1374,,,,,,,,,,,,,0,,,,,S,sols,,,435,-0.929621,46.797405
2020-1233458,2020-02-26,000001,Vente,45000,,,LE BOURG,B049,85510,85031,Le Boupère,85,,,85031000AB1052,,,,,,,,,,,,,0,,,,,S,sols,,,89,-0.929134,46.794886
2020-1233458,2020-02-26,000001,Vente,45000,22,,RUE DU MAL FOCH,0085,85510,85031,Le Boupère,85,,,85031000AB1163,,,,,,,,,,,,,0,1,Maison,60,3,S,sols,,,71,-0.929177,46.794784
2020-1233460,2020-03-10,000001,Vente,268933.88,,,LE BOURG,B049,85510,85031,Le Boupère,85,,,85031000AB0554,,,,,,,,,,,,,0,,,,,S,sols,,,647,,
2020-1233460,2020-03-10,000001,Vente,268933.88,,,LE BOURG,B049,85510,85031,Le Boupère,85,,,85031000AB0554,,,,,,,,,,,,,0,,,,,AG,terrains d'agrément,,,1183,,
2020-1233460,2020-03-10,000001,Vente,268933.88,,,LE BOURG,B049,85510,85031,Le Boupère,85,,,85031000AB0556,,,,,,,,,,,,,0,,,,,AG,terrains d'agrément,,,2779,,
2020-1233460,2020-03-10,000001,Vente,268933.88,,,LE BOURG,B049,85510,85031,Le Boupère,85,,,85031000AB0616,,,,,,,,,,,,,0,,,,,T,terres,,,14,-0.924393,46.795412
2020-1233460,2020-03-10,000001,Vente,268933.88,,,LE BOURG,B049,85510,85031,Le Boupère,85,,,85031000AB0617,,,,,,,,,,,,,0,,,,,T,terres,,,196,-0.924594,46.795462
2020-1233460,2020-03-10,000001,Vente,268933.88,2,B,RUE DU BEAUMONT,0009,85510,85031,Le Boupère,85,,,85031000AB1358,,,,,,,,,,,,,0,3,Dépendance,,0,S,sols,,,393,-0.924653,46.795095
2020-1233460,2020-03-10,000001,Vente,268933.88,2,B,RUE DU BEAUMONT,0009,85510,85031,Le Boupère,85,,,85031000AB1361,,,,,,,,,,,,,0,,,,,J,jardins,,,388,-0.925094,46.795174
2020-1233486,2020-03-03,000001,Vente,95250,3,,FIEF MILON,B264,85510,85031,Le Boupère,85,,,850310000G0670,,,,,,,,,,,,,0,1,Maison,120,3,S,sols,,,276,-0.900619,46.764403
2020-1233486,2020-03-03,000001,Vente,95250,,,FIEF MILON,B264,85510,85031,Le Boupère,85,,,850310000G0671,,,,,,,,,,,,,0,,,,,J,jardins,,,1515,-0.900987,46.76452
2020-1233486,2020-03-03,000001,Vente,95250,,,FIEF MILON,B264,85510,85031,Le Boupère,85,,,850310000G0682,,,,,,,,,,,,,0,,,,,P,prés,,,260,-0.900873,46.764859
2020-1233486,2020-03-03,000001,Vente,95250,,,FIEF MILON,B264,85510,85031,Le Boupère,85,,,850310000G0683,,,,,,,,,,,,,0,,,,,S,sols,,,545,-0.900835,46.764689
2020-1233568,2020-04-24,000001,Vente,210000,3,,RUE EUGENE CHARRIER,0050,85510,85031,Le Boupère,85,,,85031000AB0350,,,,,,,,,,,,,0,3,Dépendance,,0,S,sols,,,1705,-0.930265,46.794986
2020-1233568,2020-04-24,000001,Vente,210000,3,,RUE EUGENE CHARRIER,0050,85510,85031,Le Boupère,85,,,85031000AB0350,,,,,,,,,,,,,0,3,Dépendance,,0,S,sols,,,1705,-0.930265,46.794986
2020-1233568,2020-04-24,000001,Vente,210000,3,,RUE EUGENE CHARRIER,0050,85510,85031,Le Boupère,85,,,85031000AB0350,,,,,,,,,,,,,0,3,Dépendance,,0,S,sols,,,1705,-0.930265,46.794986
2020-1233568,2020-04-24,000001,Vente,210000,3,,RUE EUGENE CHARRIER,0050,85510,85031,Le Boupère,85,,,85031000AB0350,,,,,,,,,,,,,0,3,Dépendance,,0,S,sols,,,1705,-0.930265,46.794986
2020-1233568,2020-04-24,000001,Vente,210000,3,,RUE EUGENE CHARRIER,0050,85510,85031,Le Boupère,85,,,85031000AB0350,,,,,,,,,,,,,0,3,Dépendance,,0,S,sols,,,1705,-0.930265,46.794986
2020-1233568,2020-04-24,000001,Vente,210000,3,,RUE EUGENE CHARRIER,0050,85510,85031,Le Boupère,85,,,85031000AB0350,,,,,,,,,,,,,0,3,Dépendance,,0,S,sols,,,1705,-0.930265,46.794986
2020-1233568,2020-04-24,000001,Vente,210000,3,,RUE EUGENE CHARRIER,0050,85510,85031,Le Boupère,85,,,85031000AB0350,,,,,,,,,,,,,0,3,Dépendance,,0,S,sols,,,1705,-0.930265,46.794986
2020-1233568,2020-04-24,000001,Vente,210000,3,,RUE EUGENE CHARRIER,0050,85510,85031,Le Boupère,85,,,85031000AB0350,,,,,,,,,,,,,0,1,Maison,117,4,S,sols,,,1705,-0.930265,46.794986
2020-1233568,2020-04-24,000001,Vente,210000,3,,RUE EUGENE CHARRIER,0050,85510,85031,Le Boupère,85,,,85031000AB0350,,,,,,,,,,,,,0,1,Maison,52,3,S,sols,,,1705,-0.930265,46.794986
2020-1233568,2020-04-24,000001,Vente,210000,3,,RUE EUGENE CHARRIER,0050,85510,85031,Le Boupère,85,,,85031000AB0350,,,,,,,,,,,,,0,1,Maison,99,3,S,sols,,,1705,-0.930265,46.794986
2020-1233568,2020-04-24,000001,Vente,210000,3,,RUE EUGENE CHARRIER,0050,85510,85031,Le Boupère,85,,,85031000AB0350,,,,,,,,,,,,,0,4,Local industriel. commercial ou assimilé,,0,S,sols,,,1705,-0.930265,46.794986
2020-1233568,2020-04-24,000001,Vente,210000,,,LE BOURG,B049,85510,85031,Le Boupère,85,,,85031000AB0829,,,,,,,,,,,,,0,,,,,S,sols,,,401,-0.930611,46.795203
2020-1233587,2020-04-09,000001,Vente,100000,11,,CITE DE LA PREE SECHE,A075,85510,85031,Le Boupère,85,,,850310000D2180,,,,,,,,,,,,,0,1,Maison,62,3,S,sols,,,135,-0.92312,46.799634
2020-1233685,2020-05-15,000001,Vente,330000,725,F,LA MAISONNETTE,B371,85510,85031,Le Boupère,85,,,850310000C0725,,,,,,,,,,,,,0,1,Maison,161,5,J,jardins,,,1000,-0.95161,46.792192
2020-1233685,2020-05-15,000001,Vente,330000,725,F,LA MAISONNETTE,B371,85510,85031,Le Boupère,85,,,850310000C0725,,,,,,,,,,,,,0,1,Maison,161,5,S,sols,,,500,-0.95161,46.792192
2020-1233685,2020-05-15,000001,Vente,330000,725,F,LA MAISONNETTE,B371,85510,85031,Le Boupère,85,,,850310000C0725,,,,,,,,,,,,,0,1,Maison,161,5,T,terres,,,400,-0.95161,46.792192
2020-1233687,2020-05-15,000001,Vente,185000,3,,RUE DU BEAUMONT,0009,85510,85031,Le Boupère,85,,,85031000AB1085,,,,,,,,,,,,,0,1,Maison,98,4,J,jardins,,,1037,-0.923832,46.795177
2020-1233687,2020-05-15,000001,Vente,185000,3,,RUE DU BEAUMONT,0009,85510,85031,Le Boupère,85,,,85031000AB1085,,,,,,,,,,,,,0,1,Maison,98,4,S,sols,,,797,-0.923832,46.795177
2020-1233704,2020-05-11,000001,Vente,40000,,,LA NIVRETIERE,B387,85510,85031,Le Boupère,85,,,850310000E0679,,,,,,,,,,,,,0,,,,,S,sols,,,349,-0.919208,46.77234
2020-1233704,2020-05-11,000001,Vente,40000,5478,,LA NIVRETIERE,B387,85510,85031,Le Boupère,85,,,850310000E1635,,,,,,,,,,,,,0,1,Maison,80,3,S,sols,,,230,-0.919363,46.772513
2020-1233785,2020-05-18,000001,Echange,500,,,LA DAVIERE,B209,85510,85031,Le Boupère,85,,,850310000B0494,,,,,,,,,,,,,0,,,,,P,prés,,,1760,-0.950637,46.801387
2020-1233785,2020-05-18,000002,Echange,500,,,FIEF DU DOUET,B257,85510,85031,Le Boupère,85,,,850310000B0537,,,,,,,,,,,,,0,,,,,T,terres,,,420,-0.951187,46.802288
2020-1233785,2020-05-18,000002,Echange,500,,,FIEF DU DOUET,B257,85510,85031,Le Boupère,85,,,850310000B0538,,,,,,,,,,,,,0,,,,,VI,vignes,,,983,-0.95105,46.8023
2020-1233795,2020-05-18,000001,Vente,215000,13,,RUE DU COMMANDANT GRELET,0031,85510,85031,Le Boupère,85,,,85031000AB1155,,,,,,,,,,,,,0,1,Maison,94,6,S,sols,,,500,-0.926501,46.792
2020-1233795,2020-05-18,000001,Vente,215000,13,,RUE DU COMMANDANT GRELET,0031,85510,85031,Le Boupère,85,,,85031000AB1155,,,,,,,,,,,,,0,1,Maison,94,6,J,jardins,,,808,-0.926501,46.792
2020-1233884,2020-05-14,000002,Vente,117000,4,B,IMP DES NOSIERES,0103,85510,85031,Le Boupère,85,,,85031000AB1368,,,,,,,,,,,,,0,,,,,S,sols,,,396,-0.922754,46.794377
2020-1233909,2020-05-25,000001,Vente,160000,15,,LOT LE GD CHENE,A044,85510,85031,Le Boupère,85,,,850310000D1393,,,,,,,,,,,,,0,1,Maison,93,4,S,sols,,,700,-0.924896,46.79767
2020-1233938,2020-05-27,000001,Vente,160000,5527,,VOIREAU,B636,85510,85031,Le Boupère,85,,,850310000E1685,,,,,,,,,,,,,0,1,Maison,79,4,J,jardins,,,505,-0.918005,46.778589
2020-1233938,2020-05-27,000001,Vente,160000,5527,,VOIREAU,B636,85510,85031,Le Boupère,85,,,850310000E1685,,,,,,,,,,,,,0,1,Maison,79,4,S,sols,,,269,-0.918005,46.778589
2020-1234118,2020-06-03,000001,Vente,18957,,,RUE HENRI DE LA ROCHEJACQUELIN,0070,85510,85031,Le Boupère,85,,,85031000AB1315,,,,,,,,,,,,,0,,,,,AB,terrains a bâtir,,,267,-0.930555,46.796339
2020-1234133,2020-06-08,000002,Vente,80000,5439,,PIFFECAUD,B455,85510,85031,Le Boupère,85,,,850310000G2036,,,,,,,,,,,,,0,1,Maison,20,0,,,,,,-0.908856,46.76728
2020-1234133,2020-06-08,000002,Vente,80000,5439,,PIFFECAUD,B455,85510,85031,Le Boupère,85,,,850310000G2036,,,,,,,,,,,,,0,1,Maison,152,7,,,,,,-0.908856,46.76728
2020-1234167,2020-06-10,000001,Vente,1454,,,LE CHAMP DU BOUC,B129,85510,85031,Le Boupère,85,,,850310000B0883,,,,,,,,,,,,,0,,,,,T,terres,,,4770,-0.944565,46.796579
2020-1234167,2020-06-10,000001,Vente,1454,,,LE CHAMP DU BOUC,B129,85510,85031,Le Boupère,85,,,850310000B0884,,,,,,,,,,,,,0,,,,,T,terres,,,2500,-0.945465,46.797033
2020-1234203,2020-06-09,000001,Vente,98000,1,,LA NIRAUDIERE,B386,85510,85031,Le Boupère,85,,,850310000B1454,,,,,,,,,,,,,0,1,Maison,107,5,J,jardins,,,560,-0.9416,46.800868
2020-1234203,2020-06-09,000001,Vente,98000,1,,LA NIRAUDIERE,B386,85510,85031,Le Boupère,85,,,850310000B1454,,,,,,,,,,,,,0,1,Maison,107,5,S,sols,,,640,-0.9416,46.800868
2020-1234272,2020-06-24,000001,Vente,15870,20,,RUE DU GALLERON,0059,85510,85031,Le Boupère,85,,,850310000D2064,,,,,,,,,,,,,0,,,,,AB,terrains a bâtir,,,345,-0.925492,46.800735
2020-1234313,2020-06-25,000001,Vente,139500,2,,RUE GEORGES CLEMENCEAU,0061,85510,85031,Le Boupère,85,,,85031000AB1363,,,,,,,,,,,,,0,1,Maison,149,6,S,sols,,,950,-0.930789,46.794334
2020-1234313,2020-06-25,000001,Vente,139500,2,,RUE GEORGES CLEMENCEAU,0061,85510,85031,Le Boupère,85,,,85031000AB1363,,,,,,,,,,,,,0,3,Dépendance,,0,S,sols,,,950,-0.930789,46.794334
2020-1234365,2020-07-06,000001,Vente,766.2,,,CHAMP DE LA CROIX,B089,85510,85031,Le Boupère,85,,,850310000D0809,,,,,,,,,,,,,0,,,,,T,terres,,,2700,-0.908101,46.793376
2020-1234365,2020-07-06,000001,Vente,766.2,,,FIEF DE LA GILLERAIE,B238,85510,85031,Le Boupère,85,,,850310000D0812,,,,,,,,,,,,,0,,,,,T,terres,,,317,-0.908184,46.793246
2020-1234365,2020-07-06,000001,Vente,766.2,,,FIEF DE LA GILLERAIE,B238,85510,85031,Le Boupère,85,,,850310000D0814,,,,,,,,,,,,,0,,,,,T,terres,,,252,-0.908417,46.793297
2020-1234365,2020-07-06,000001,Vente,766.2,,,FIEF DE LA GILLERAIE,B238,85510,85031,Le Boupère,85,,,850310000D0822,,,,,,,,,,,,,0,,,,,T,terres,,,562,-0.909041,46.793492
2020-1234409,2020-07-10,000001,Vente,125000,11,,RUE GENERAL DE GAULLE,0060,85510,85031,Le Boupère,85,,,85031000AB0221,,,,,,,,,,,,,0,1,Maison,157,6,S,sols,,,116,-0.927336,46.794078
2020-1234409,2020-07-10,000001,Vente,125000,11,B,RUE GENERAL DE GAULLE,0060,85510,85031,Le Boupère,85,,,85031000AB0471,,,,,,,,,,,,,0,3,Dépendance,,0,S,sols,,,58,-0.927275,46.794049
2020-1234409,2020-07-10,000001,Vente,125000,,,LE BOURG,B049,85510,85031,Le Boupère,85,,,85031000AB0678,,,,,,,,,,,,,0,,,,,S,sols,,,8,-0.927288,46.794126
2020-1234409,2020-07-10,000001,Vente,125000,,,LE BOURG,B049,85510,85031,Le Boupère,85,,,85031000AB0710,,,,,,,,,,,,,0,,,,,S,sols,,,4,-0.92732,46.794141
2020-1234531,2020-07-23,000001,Vente,23368,15,,RUE DU GALLERON,0059,85510,85031,Le Boupère,85,,,850310000D2060,,,,,,,,,,,,,0,,,,,AB,terrains a bâtir,,,508,-0.925949,46.800938
2020-1234582,2020-07-13,000001,Vente,56000,5,,CITE DE LA PREE SECHE,A075,85510,85031,Le Boupère,85,,,850310000D2174,,,,,,,,,,,,,0,1,Maison,62,3,S,sols,,,158,-0.923301,46.799288
2020-1234799,2020-08-06,000001,Vente,50000,5057,,RUE DE LA MARNE,0093,85510,85031,Le Boupère,85,,,85031000AB0541,,,,,,,,,,,,,0,4,Local industriel. commercial ou assimilé,250,0,S,sols,,,341,-0.92583,46.795046
2020-1234856,2020-08-18,000002,Vente,143.7,,,LA BALLIERE,B012,85510,85031,Le Boupère,85,,,850310000E2241,,,,,,,,,,,,,0,,,,,T,terres,,,333,-0.899938,46.778413
2020-1234856,2020-08-18,000002,Vente,143.7,,,LA BALLIERE,B012,85510,85031,Le Boupère,85,,,850310000E2243,,,,,,,,,,,,,0,,,,,T,terres,,,625,-0.899588,46.778241
2020-1234862,2020-08-28,000001,Vente,944.32,,,LA NIVRETIERE,B387,85510,85031,Le Boupère,85,,,850310000E0672,,,,,,,,,,,,,0,,,,,P,prés,,,1340,-0.919687,46.772798
2020-1234863,2020-08-26,000001,Vente,12357,,,LES GATTES BILLERES,B293,85510,85031,Le Boupère,85,,,850310000D0357,,,,,,,,,,,,,0,,,,,T,terres,,,6195,-0.907761,46.798962
2020-1234863,2020-08-26,000001,Vente,12357,,,LE GRAND CHAMP,B306,85510,85031,Le Boupère,85,,,850310000D1285,,,,,,,,,,,,,0,,,,,P,prés,,,1039,-0.907047,46.798817
2020-1234863,2020-08-26,000001,Vente,12357,,,LE FIEF PRIEUR,B265,85510,85031,Le Boupère,85,,,850310000D1287,,,,,,,,,,,,,0,,,,,T,terres,,,2659,-0.907678,46.799389
2020-1234865,2020-08-24,000001,Vente,208,,,LE FIEF DE LA ROCHE DU MIL,B244,85510,85031,Le Boupère,85,,,850310000E1270,,,,,,,,,,,,,0,,,,,VI,vignes,,,832,-0.927051,46.789473
2020-1234869,2020-08-24,000001,Vente,228125,11,,RUE WOLFGANG AMADEUS MOZART,0100,85510,85031,Le Boupère,85,,,850310000D1965,,,,,,,,,,,,,0,1,Maison,140,5,S,sols,,,778,-0.923289,46.798262
2020-1234974,2020-08-27,000001,Vente,140000,33,,L HAUMONDIERE,B336,85510,85031,Le Boupère,85,,,850310000G0284,,,,,,,,,,,,,0,3,Dépendance,,0,S,sols,,,145,-0.903092,46.757388
2020-1234974,2020-08-27,000001,Vente,140000,,,L HAUMONDIERE,B336,85510,85031,Le Boupère,85,,,850310000G0285,,,,,,,,,,,,,0,,,,,S,sols,,,802,-0.903246,46.757231
2020-1234974,2020-08-27,000001,Vente,140000,5392,,AUMONDIERE,B640,85510,85031,Le Boupère,85,,,850310000G0288,,,,,,,,,,,,,0,1,Maison,100,3,S,sols,,,100,-0.903605,46.75727
2020-1234974,2020-08-27,000001,Vente,140000,,,L HAUMONDIERE,B336,85510,85031,Le Boupère,85,,,850310000G1671,,,,,,,,,,,,,0,,,,,S,sols,,,71,-0.903618,46.757309
2020-1235011,2020-09-04,000001,Vente,170000,1,,RUE DE LA COUSSOTTE,0032,85510,85031,Le Boupère,85,,,850310000D1158,,,,,,,,,,,,,0,1,Maison,88,5,S,sols,,,510,-0.925636,46.798737
2020-1235011,2020-09-04,000001,Vente,170000,,,CHAMP DU CORMIER,B134,85510,85031,Le Boupère,85,,,850310000D1188,,,,,,,,,,,,,0,,,,,T,terres,,,180,-0.925462,46.798851
2020-1235015,2020-08-28,000001,Echange,762,,,LA GROSSELINIERE,B331,85510,85031,Le Boupère,85,,,850310000G1804,,,,,,,,,,,,,0,,,,,T,terres,,,382,-0.869251,46.772012
2020-1235015,2020-08-28,000002,Echange,762,,,LA GROSSELINIERE,B331,85510,85031,Le Boupère,85,,,850310000G1486,,,,,,,,,,,,,0,,,,,P,prés,,,260,-0.868753,46.771114
2020-1235015,2020-08-28,000002,Echange,762,,,LA CHAUSSEE DU BOIS MENARD,B177,85510,85031,Le Boupère,85,,,850310000G1515,,,,,,,,,,,,,0,,,,,P,prés,,,895,-0.868633,46.77114
2020-1235221,2020-09-16,000001,Vente,2586.3,,,LE CORNILLON,B194,85510,85031,Le Boupère,85,,,850310000G0170,,,,,,,,,,,,,0,,,,,P,prés,,,2510,-0.904981,46.761476
2020-1235221,2020-09-16,000001,Vente,2586.3,,,LE CORNILLON,B194,85510,85031,Le Boupère,85,,,850310000G0172,,,,,,,,,,,,,0,,,,,T,terres,,,3895,-0.903924,46.762251
2020-1235221,2020-09-16,000001,Vente,2586.3,,,LE CORNILLON,B194,85510,85031,Le Boupère,85,,,850310000G0173,,,,,,,,,,,,,0,,,,,VI,vignes,,,1625,-0.903568,46.761969
2020-1235221,2020-09-16,000001,Vente,2586.3,,,LE CORNILLON,B194,85510,85031,Le Boupère,85,,,850310000G0174,,,,,,,,,,,,,0,,,,,T,terres,,,2630,-0.904433,46.761436
2020-1235221,2020-09-16,000001,Vente,2586.3,,,LA GRIPPE,B325,85510,85031,Le Boupère,85,,,850310000G0361,,,,,,,,,,,,,0,,,,,T,terres,,,1760,-0.906675,46.758223
2020-1235221,2020-09-16,000001,Vente,2586.3,,,LA GRIPPE,B325,85510,85031,Le Boupère,85,,,850310000G0362,,,,,,,,,,,,,0,,,,,T,terres,,,1900,-0.90652,46.75773
2020-1235221,2020-09-16,000001,Vente,2586.3,,,LE BOURSEAU,B051,85510,85031,Le Boupère,85,,,850310000G0385,,,,,,,,,,,,,0,,,,,T,terres,,,2922,-0.906608,46.762085
2020-1235427,2020-10-06,000002,Vente,85000,,,LA RAMEE,B545,85510,85031,Le Boupère,85,,,850310000B0571,,,,,,,,,,,,,0,,,,,S,sols,,,180,-0.957622,46.804774
2020-1235427,2020-10-06,000002,Vente,85000,,,LA RAMEE,B545,85510,85031,Le Boupère,85,,,850310000B1488,,,,,,,,,,,,,0,,,,,S,sols,,,1102,-0.9577,46.804618
2020-1235427,2020-10-06,000002,Vente,85000,6,,LA RAMEE,B545,85510,85031,Le Boupère,85,,,850310000B1564,,,,,,,,,,,,,0,1,Maison,58,2,S,sols,,,210,-0.957443,46.804919
2020-1235427,2020-10-06,000002,Vente,85000,,,LA RAMEE,B545,85510,85031,Le Boupère,85,,,850310000B2424,,,,,,,,,,,,,0,,,,,S,sols,,,80,-0.957345,46.804809
2020-1235427,2020-10-06,000002,Vente,85000,,,LA RAMEE,B545,85510,85031,Le Boupère,85,,,850310000B2427,,,,,,,,,,,,,0,,,,,S,sols,,,15,-0.95755,46.804824
2020-1235449,2020-10-07,000001,Vente,25,,,PIFFECAUD,B455,85510,85031,Le Boupère,85,,,850310000G1732,,,,,,,,,,,,,0,,,,,J,jardins,,,235,-0.908679,46.766687
2020-1235482,2020-10-01,000001,Vente,160000,3,,RUE DES BOULEAUX,0174,85510,85031,Le Boupère,85,,,850310000B2373,,,,,,,,,,,,,0,4,Local industriel. commercial ou assimilé,253,0,S,sols,,,954,-0.933871,46.796992
2020-1235492,2020-10-08,000001,Vente,7440.4,,,LE PALNA,B406,85510,85031,Le Boupère,85,,,850310000A0508,,,,,,,,,,,,,0,,,,,P,prés,,,12820,-0.970956,46.803288
2020-1235492,2020-10-08,000001,Vente,7440.4,,,TENEMENT DE LA THIBAUDIER,B605,85510,85031,Le Boupère,85,,,850310000A1543,,,,,,,,,,,,,0,,,,,P,prés,,,580,-0.980382,46.802079
2020-1235492,2020-10-08,000001,Vente,7440.4,,,LE GRAND CHAMP,B306,85510,85031,Le Boupère,85,,,850310000A1546,,,,,,,,,,,,,0,,,,,T,terres,,,20420,-0.981059,46.80204
2020-1235493,2020-10-08,000001,Vente,7334.8,,,LE GRAND CHAMP,B306,85510,85031,Le Boupère,85,,,850310000A1407,,,,,,,,,,,,,0,,,,,T,terres,,,33340,-0.98309,46.801798
2020-1235594,2020-10-16,000001,Vente,139000,,,LA NIVRETIERE,B387,85510,85031,Le Boupère,85,,,850310000E0632,,,,,,,,,,,,,0,,,,,J,jardins,,,75,-0.918959,46.773603
2020-1235594,2020-10-16,000001,Vente,139000,2,,LA NIVRETIERE,B387,85510,85031,Le Boupère,85,,,850310000E0634,,,,,,,,,,,,,0,1,Maison,82,3,S,sols,,,458,-0.918947,46.773522
2020-1235594,2020-10-16,000001,Vente,139000,,,LA NIVRETIERE,B387,85510,85031,Le Boupère,85,,,850310000E0637,,,,,,,,,,,,,0,,,,,S,sols,,,85,-0.919212,46.773326
2020-1235594,2020-10-16,000001,Vente,139000,,,LA NIVRETIERE,B387,85510,85031,Le Boupère,85,,,850310000E2025,,,,,,,,,,,,,0,,,,,S,sols,,,519,-0.919063,46.773289
2020-1235594,2020-10-16,000001,Vente,139000,5475,,LA NIVRETIERE,B387,85510,85031,Le Boupère,85,,,850310000E2026,,,,,,,,,,,,,0,1,Maison,30,0,S,sols,,,40,-0.91921,46.773243
2020-1235642,2020-10-19,000001,Vente,175000,18,,RUE DU MUGUET,0102,85510,85031,Le Boupère,85,,,850310000D1845,,,,,,,,,,,,,0,1,Maison,92,4,S,sols,,,659,-0.920425,46.795408
2020-1235665,2020-10-20,000001,Vente,194000,2,,RUE DU COMMANDANT GRELET,0031,85510,85031,Le Boupère,85,,,85031000AB1098,,,,,,,,,,,,,0,1,Maison,95,4,S,sols,,,882,-0.92435,46.792751
2020-1235721,2020-10-22,000001,Vente,120000,5374,,L HAUMONDIERE,B336,85510,85031,Le Boupère,85,,,850310000G0310,,,,,,,,,,,,,0,1,Maison,109,4,S,sols,,,730,-0.903625,46.756702
2020-1235750,2020-11-09,000001,Vente,155000,,,LES ROCHES,B556,85510,85031,Le Boupère,85,,,850310000A0639,,,,,,,,,,,,,0,,,,,S,sols,,,282,-0.972301,46.808941
2020-1235750,2020-11-09,000001,Vente,155000,5737,,LES ROCHES,B556,85510,85031,Le Boupère,85,,,850310000A1305,,,,,,,,,,,,,0,1,Maison,144,6,S,sols,,,722,-0.972332,46.809161
2020-1235750,2020-11-09,000001,Vente,155000,,,LES ROCHES,B556,85510,85031,Le Boupère,85,,,850310000A1723,,,,,,,,,,,,,0,,,,,S,sols,,,171,-0.972447,46.809002
2020-1235765,2020-11-09,000001,Vente,2125,,,BEAUCHENE,B018,85510,85031,Le Boupère,85,,,850310000G0977,,,,,,,,,,,,,0,,,,,S,sols,,,490,-0.881044,46.766569
2020-1235765,2020-11-09,000001,Vente,2125,,,BEAUCHENE,B018,85510,85031,Le Boupère,85,,,850310000G0978,,,,,,,,,,,,,0,,,,,BT,taillis simples,,,5910,-0.881259,46.767064
2020-1235765,2020-11-09,000001,Vente,2125,,,FIEF MILON,B264,85510,85031,Le Boupère,85,,,850310000G1778,,,,,,,,,,,,,0,,,,,T,terres,,,3700,-0.894832,46.771889
2020-1235836,2020-10-23,000001,Vente,55000,5610,,LE CHATAIGNIER,B175,85510,85031,Le Boupère,85,,,850310000B1098,,,,,,,,,,,,,0,1,Maison,41,1,S,sols,,,71,-0.974587,46.795037
2020-1235836,2020-10-23,000001,Vente,55000,,,LE CHATAIGNIER,B175,85510,85031,Le Boupère,85,,,850310000B1099,,,,,,,,,,,,,0,,,,,S,sols,,,80,-0.97469,46.794992
2020-1235836,2020-10-23,000001,Vente,55000,,,LE CHATAIGNIER,B175,85510,85031,Le Boupère,85,,,850310000B2174,,,,,,,,,,,,,0,,,,,S,sols,,,19,-0.974601,46.795083
2020-1235903,2020-11-09,000001,Vente,29000,1,B,PL DE LA LIBERATION,0080,85510,85031,Le Boupère,85,,,85031000AB1118,,,,,,,,,,,,,0,4,Local industriel. commercial ou assimilé,55,0,S,sols,,,55,-0.927155,46.793436
2020-1235940,2020-11-12,000002,Vente,85000,,,LA DAVIERE,B209,85510,85031,Le Boupère,85,,,850310000B2431,,,,,,,,,,,,,0,,,,,S,sols,,,74,-0.952257,46.799712
2020-1235940,2020-11-12,000002,Vente,85000,14,,N DE SAUMUR,0051,85510,85031,Le Boupère,85,,,850310000B2432,,,,,,,,,,,,,0,1,Maison,51,3,S,sols,,,153,-0.95222,46.79964