id_mutation,date_mutation,numero_disposition,nature_mutation,valeur_fonciere,adresse_numero,adresse_suffixe,adresse_nom_voie,adresse_code_voie,code_postal,code_commune,nom_commune,code_departement,ancien_code_commune,ancien_nom_commune,id_parcelle,ancien_id_parcelle,numero_volume,lot1_numero,lot1_surface_carrez,lot2_numero,lot2_surface_carrez,lot3_numero,lot3_surface_carrez,lot4_numero,lot4_surface_carrez,lot5_numero,lot5_surface_carrez,nombre_lots,code_type_local,type_local,surface_reelle_bati,nombre_pieces_principales,code_nature_culture,nature_culture,code_nature_culture_speciale,nature_culture_speciale,surface_terrain,longitude,latitude
2020-1236947,2020-01-30,000001,Vente,160000,9,,RUE DU LION D'OR,0449,85430,85161,Nieul-le-Dolent,85,,,85161000ZP0152,,,,,,,,,,,,,0,1,Maison,70,3,S,sols,,,459,-1.50958,46.569772
2020-1237033,2020-01-16,000001,Vente,12643,,,LE GARANDEAU,B052,85430,85161,Nieul-le-Dolent,85,,,85161000ZX0066,,,,,,,,,,,,,0,,,,,T,terres,,,74371,-1.532597,46.593488
2020-1237046,2020-02-06,000001,Vente,130920,3,,RUE DES JONQUILLES,0331,85430,85161,Nieul-le-Dolent,85,,,85161000AA0086,,,,,,,,,,,,,0,1,Maison,82,4,S,sols,,,652,-1.512551,46.574628
2020-1237236,2020-01-20,000001,Vente,75000,9020,,BELLEVUE,B008,85430,85161,Nieul-le-Dolent,85,,,85161000AD0220,,,1,215.45,,,,,,,,,1,4,Local industriel. commercial ou assimilé,221,0,,,,,,-1.509477,46.571074
2020-1237303,2020-01-29,000001,Vente,54756,54,,RUE FLORENCE ARTHAUD,0450,85430,85161,Nieul-le-Dolent,85,,,85161000AA0274,,,,,,,,,,,,,0,,,,,AB,terrains a bâtir,,,702,-1.513587,46.5716
2020-1237338,2020-02-03,000002,Vente,102000,16,,RUE DE LA POSTE,0395,85430,85161,Nieul-le-Dolent,85,,,85161000AB0328,,,,,,,,,,,,,0,1,Maison,73,5,,,,,,-1.512517,46.57571
2020-1237561,2020-02-10,000001,Vente,2500,,,LA MONERIE,B091,85430,85161,Nieul-le-Dolent,85,,,85161000ZW0129,,,,,,,,,,,,,0,,,,,S,sols,,,15,-1.519271,46.577273
2020-1237561,2020-02-10,000001,Vente,2500,,,LA MONERIE,B091,85430,85161,Nieul-le-Dolent,85,,,85161000ZW0132,,,,,,,,,,,,,0,,,,,S,sols,,,80,-1.519338,46.577251
2020-1237563,2020-02-07,000001,Vente,136000,5328,,LA LIAMIERE,B083,85430,85161,Nieul-le-Dolent,85,,,85161000ZT0050,,,,,,,,,,,,,0,1,Maison,108,4,J,jardins,,,550,-1.543454,46.575287
2020-1237563,2020-02-07,000001,Vente,136000,5328,,LA LIAMIERE,B083,85430,85161,Nieul-le-Dolent,85,,,85161000ZT0050,,,,,,,,,,,,,0,1,Maison,108,4,S,sols,,,1350,-1.543454,46.575287
2020-1237563,2020-02-07,000001,Vente,136000,,,LES BERTAUDIERES,B010,85430,85161,Nieul-le-Dolent,85,,,85161000ZT0074,,,,,,,,,,,,,0,,,,,S,sols,,,613,-1.543676,46.575321
2020-1237563,2020-02-07,000001,Vente,136000,,,LES BERTAUDIERES,B010,85430,85161,Nieul-le-Dolent,85,,,85161000ZT0075,,,,,,,,,,,,,0,,,,,T,terres,,,7120,-1.542217,46.575393
2020-1237755,2020-02-19,000001,Vente,26000,48,,RUE FLORENCE ARTHAUD,0450,85430,85161,Nieul-le-Dolent,85,,,85161000AA0292,,,,,,,,,,,,,0,,,,,AB,terrains a bâtir,,,324,-1.514549,46.57179
2020-1237755,2020-02-19,000001,Vente,26000,,,LE VIVIER,B138,85430,85161,Nieul-le-Dolent,85,,,85161000ZR0313,,,,,,,,,,,,,0,,,,,T,terres,,,225,-1.51465,46.571604
2020-1237797,2020-02-14,000001,Vente,45240,10,,RUE FLORENCE ARTHAUD,0450,85430,85161,Nieul-le-Dolent,85,,,85161000AA0236,,,,,,,,,,,,,0,,,,,AB,terrains a bâtir,,,580,-1.511843,46.572027
2020-1237977,2020-02-29,000001,Vente,88000,36,,RUE DE LATTRE DE TASSIGNY,0360,85430,85161,Nieul-le-Dolent,85,,,85161000AC0129,,,,,,,,,,,,,0,1,Maison,83,4,S,sols,,,734,-1.502164,46.574978
2020-1238118,2020-03-13,000001,Vente,140000,22,,RUE DES PRIMEVERES,0394,85430,85161,Nieul-le-Dolent,85,,,85161000AA0076,,,,,,,,,,,,,0,1,Maison,80,3,S,sols,,,708,-1.51351,46.57393
2020-1238182,2020-03-18,000001,Vente,195000,21,,RUE DES PRIMEVERES,0394,85430,85161,Nieul-le-Dolent,85,,,85161000AA0056,,,,,,,,,,,,,0,1,Maison,110,5,S,sols,,,684,-1.513573,46.573542
2020-1238210,2020-03-04,000001,Vente,65000,7,,RUE DU VIEUX BOURG,0440,85430,85161,Nieul-le-Dolent,85,,,85161000AB0312,,,,,,,,,,,,,0,1,Maison,120,4,S,sols,,,380,-1.508865,46.575212
2020-1238407,2020-03-16,000001,Vente,315000,44,,RUE ARTHUR CHAUVET,0052,85430,85161,Nieul-le-Dolent,85,,,85161000AD0237,,,,,,,,,,,,,0,1,Maison,159,6,S,sols,,,500,-1.501564,46.572425
2020-1238407,2020-03-16,000001,Vente,315000,44,,RUE ARTHUR CHAUVET,0052,85430,85161,Nieul-le-Dolent,85,,,85161000AD0237,,,,,,,,,,,,,0,1,Maison,159,6,AG,terrains d'agrément,,,792,-1.501564,46.572425
2020-1238435,2020-03-16,000001,Vente,160000,5641,,ZA DU VIVIER,A001,85430,85161,Nieul-le-Dolent,85,,,85161000ZR0083,,,,,,,,,,,,,0,4,Local industriel. commercial ou assimilé,801,0,S,sols,,,3503,-1.512011,46.570488
2020-1238572,2020-04-24,000001,Vente,159000,5277,,LA GAUTERIE,B055,85430,85161,Nieul-le-Dolent,85,,,85161000ZP0129,,,,,,,,,,,,,0,1,Maison,93,4,S,sols,,,1000,-1.504386,46.562013
2020-1238572,2020-04-24,000001,Vente,159000,5277,,LA GAUTERIE,B055,85430,85161,Nieul-le-Dolent,85,,,85161000ZP0129,,,,,,,,,,,,,0,1,Maison,93,4,J,jardins,,,742,-1.504386,46.562013
2020-1238717,2020-04-15,000001,Vente,185000,8,,RUE JEAN LOUIS GROLIER,0314,85430,85161,Nieul-le-Dolent,85,,,85161000AD0244,,,,,,,,,,,,,0,1,Maison,57,2,S,sols,,,509,-1.509147,46.573676
2020-1238717,2020-04-15,000001,Vente,185000,8,,RUE JEAN LOUIS GROLIER,0314,85430,85161,Nieul-le-Dolent,85,,,85161000AD0244,,,,,,,,,,,,,0,1,Maison,87,3,S,sols,,,509,-1.509147,46.573676
2020-1238737,2020-05-16,000001,Vente,242000,13,,RUE EUGENE GREAU,0210,85430,85161,Nieul-le-Dolent,85,,,85161000AC0235,,,,,,,,,,,,,0,1,Maison,117,5,S,sols,,,980,-1.496714,46.572882
2020-1238786,2020-05-19,000001,Vente,156400,2,,IMP DES TULIPES,0435,85430,85161,Nieul-le-Dolent,85,,,85161000AA0042,,,,,,,,,,,,,0,1,Maison,85,4,S,sols,,,589,-1.51587,46.574686
2020-1238929,2020-05-12,000001,Vente,179000,5607,,VILLEDOR,B137,85430,85161,Nieul-le-Dolent,85,,,85161000ZD0149,,,,,,,,,,,,,0,1,Maison,104,5,T,terres,,,989,-1.497172,46.577405
2020-1238929,2020-05-12,000001,Vente,179000,5607,,VILLEDOR,B137,85430,85161,Nieul-le-Dolent,85,,,85161000ZD0149,,,,,,,,,,,,,0,1,Maison,104,5,S,sols,,,1250,-1.497172,46.577405
2020-1239005,2020-05-29,000001,Vente,86000,1,,RUE DU VIEUX BOURG,0440,85430,85161,Nieul-le-Dolent,85,,,85161000AB0112,,,,,,,,,,,,,0,1,Maison,84,3,S,sols,,,321,-1.509198,46.575265
2020-1239010,2020-05-15,000001,Vente,43758,47,,RUE FLORENCE ARTHAUD,0450,85430,85161,Nieul-le-Dolent,85,,,85161000AA0225,,,,,,,,,,,,,0,,,,,AB,terrains a bâtir,,,113,-1.511973,46.571365
2020-1239010,2020-05-15,000001,Vente,43758,47,,RUE FLORENCE ARTHAUD,0450,85430,85161,Nieul-le-Dolent,85,,,85161000AA0263,,,,,,,,,,,,,0,,,,,AB,terrains a bâtir,,,448,-1.512058,46.571439
2020-1239129,2020-05-19,000002,Vente,288000,26,,RUE GEORGES CLEMENCEAU,0240,85430,85161,Nieul-le-Dolent,85,,,85161000AB0330,,,,,,,,,,,,,0,1,Maison,248,7,,,,,,-1.507671,46.574075
2020-1239129,2020-05-19,000002,Vente,288000,26,,RUE GEORGES CLEMENCEAU,0240,85430,85161,Nieul-le-Dolent,85,,,85161000AB0330,,,,,,,,,,,,,0,4,Local industriel. commercial ou assimilé,38,0,,,,,,-1.507671,46.574075
2020-1239133,2020-05-12,000001,Vente,89500,5324,,LA TABARDIERE,B126,85430,85161,Nieul-le-Dolent,85,,,85161000ZT0056,,,,,,,,,,,,,0,1,Maison,126,5,J,jardins,,,755,,
2020-1239133,2020-05-12,000001,Vente,89500,5324,,LA TABARDIERE,B126,85430,85161,Nieul-le-Dolent,85,,,85161000ZT0056,,,,,,,,,,,,,0,1,Maison,126,5,S,sols,,,1230,,
2020-1239134,2020-05-15,000001,Vente,46020,64,,RUE FLORENCE ARTHAUD,0450,85430,85161,Nieul-le-Dolent,85,,,85161000AA0226,,,,,,,,,,,,,0,,,,,AB,terrains a bâtir,,,535,-1.512136,46.571058
2020-1239134,2020-05-15,000001,Vente,46020,64,,RUE FLORENCE ARTHAUD,0450,85430,85161,Nieul-le-Dolent,85,,,85161000AA0279,,,,,,,,,,,,,0,,,,,AB,terrains a bâtir,,,55,-1.512212,46.57109
2020-1239135,2020-05-15,000001,Vente,55536,23,,RUE FLORENCE ARTHAUD,0450,85430,85161,Nieul-le-Dolent,85,,,85161000AA0254,,,,,,,,,,,,,0,,,,,AB,terrains a bâtir,,,712,-1.51415,46.572328
2020-1239136,2020-05-18,000001,Vente,44070,50,,RUE FLORENCE ARTHAUD,0450,85430,85161,Nieul-le-Dolent,85,,,85161000AA0272,,,,,,,,,,,,,0,,,,,AB,terrains a bâtir,,,565,-1.514279,46.571698
2020-1239410,2020-01-27,000001,Vente,305500,14,,RUE DU LION D'OR,0449,85430,85161,Nieul-le-Dolent,85,,,85161000ZP0158,,,,,,,,,,,,,0,1,Maison,151,5,S,sols,,,602,-1.508738,46.569304
2020-1239500,2020-05-19,000001,Vente,280000,,,LES MOUSSINIERES,B094,85430,85161,Nieul-le-Dolent,85,,,85161000ZM0018,,,,,,,,,,,,,0,,,,,BF,futaies feuillues,,,15870,-1.535303,46.557443
2020-1239500,2020-05-19,000001,Vente,280000,,,LES GRANDES MORLIERES,B065,85430,85161,Nieul-le-Dolent,85,,,85161000ZM0025,,,,,,,,,,,,,0,,,,,BF,futaies feuillues,,,4480,-1.531859,46.558047
2020-1239500,2020-05-19,000001,Vente,280000,,,LES GRANDES MORLIERES,B065,85430,85161,Nieul-le-Dolent,85,,,85161000ZM0063,,,,,,,,,,,,,0,,,,,S,sols,,,110,-1.531575,46.55768
2020-1239500,2020-05-19,000001,Vente,280000,5480,,LES GRANDES MORLIERES,B065,85430,85161,Nieul-le-Dolent,85,,,85161000ZM0065,,,,,,,,,,,,,0,1,Maison,131,3,S,sols,,,1000,-1.533233,46.557986
2020-1239500,2020-05-19,000001,Vente,280000,5480,,LES GRANDES MORLIERES,B065,85430,85161,Nieul-le-Dolent,85,,,85161000ZM0065,,,,,,,,,,,,,0,1,Maison,131,3,BF,futaies feuillues,,,8470,-1.533233,46.557986
2020-1239500,2020-05-19,000001,Vente,280000,,,LES GRANDES MORLIERES,B065,85430,85161,Nieul-le-Dolent,85,,,85161000ZM0066,,,,,,,,,,,,,0,,,,,BF,futaies feuillues,,,14281,-1.533691,46.557847
2020-1239500,2020-05-19,000001,Vente,280000,,,LES GRANDES MORLIERES,B065,85430,85161,Nieul-le-Dolent,85,,,85161000ZM0068,,,,,,,,,,,,,0,,,,,BF,futaies feuillues,,,1400,-1.534941,46.556184
2020-1239500,2020-05-19,000001,Vente,280000,,,LES GRANDES VALLEES,B067,85430,85161,Nieul-le-Dolent,85,,,85161000ZM0071,,,,,,,,,,,,,0,,,,,BF,futaies feuillues,,,25000,-1.533463,46.558324
2020-1239500,2020-05-19,000001,Vente,280000,,,LA GRANDE VIGNOLIERE,B064,85430,85161,Nieul-le-Dolent,85,,,85161000ZN0133,,,,,,,,,,,,,0,,,,,BF,futaies feuillues,,,6890,-1.530469,46.557999
2020-1239500,2020-05-19,000001,Vente,280000,,,LA GRANDE VIGNOLIERE,B064,85430,85161,Nieul-le-Dolent,85,,,85161000ZN0135,,,,,,,,,,,,,0,,,,,BF,futaies feuillues,,,140,-1.530182,46.557601
2020-1239500,2020-05-19,000001,Vente,280000,,,LA GRANDE VIGNOLIERE,B064,85430,85161,Nieul-le-Dolent,85,,,85161000ZN0136,,,,,,,,,,,,,0,,,,,BF,futaies feuillues,,,880,-1.529784,46.558105
2020-1239615,2020-05-20,000001,Vente,151500,9,,RUE PIERRE GAUTRON,0390,85430,85161,Nieul-le-Dolent,85,,,85161000AD0002,,,,,,,,,,,,,0,1,Maison,95,3,S,sols,,,369,-1.509411,46.573991
2020-1239615,2020-05-20,000001,Vente,151500,,,RUE JEAN LOUIS GROLIER,0314,85430,85161,Nieul-le-Dolent,85,,,85161000AD0003,,,,,,,,,,,,,0,,,,,J,jardins,,,230,-1.509269,46.573812
2020-1239633,2020-05-28,000001,Vente,32000,10,,PL DE L EGLISE,0200,85430,85161,Nieul-le-Dolent,85,,,85161000AA0293,,,,,,,,,,,,,0,,,,,J,jardins,,,388,-1.510486,46.574384
2020-1239633,2020-05-28,000001,Vente,32000,10,,IMP DES VIOLETTES,0444,85430,85161,Nieul-le-Dolent,85,,,85161000AA0297,,,,,,,,,,,,,0,,,,,S,sols,,,25,-1.510281,46.574347
2020-1239633,2020-05-28,000001,Vente,32000,6,,RUE PIERRE GAUTRON,0390,85430,85161,Nieul-le-Dolent,85,,,85161000AA0301,,,,,,,,,,,,,0,,,,,S,sols,,,2,-1.510302,46.574282
2020-1239813,2020-06-25,000001,Vente,85000,5,,IMP DE LA VIGNE AUX ROSES,0442,85430,85161,Nieul-le-Dolent,85,,,85161000AB0102,,,,,,,,,,,,,0,1,Maison,70,3,S,sols,,,468,-1.508855,46.576386
2020-1239923,2020-06-03,000001,Vente,48500,9,,RUE ARTHUR CHAUVET,0052,85430,85161,Nieul-le-Dolent,85,,,85161000AC0169,,,,,,,,,,,,,0,1,Maison,41,1,S,sols,,,211,-1.50534,46.574005
2020-1240172,2020-06-15,000001,Vente,60060,56,,RUE FLORENCE ARTHAUD,0450,85430,85161,Nieul-le-Dolent,85,,,85161000AA0275,,,,,,,,,,,,,0,,,,,AB,terrains a bâtir,,,770,-1.513178,46.57153
2020-1240416,2020-06-25,000001,Vente,172000,6,,IMP DU CHATEAU,0111,85430,85161,Nieul-le-Dolent,85,,,85161000AC0076,,,,,,,,,,,,,0,1,Maison,114,4,S,sols,,,670,-1.500262,46.57585
2020-1240500,2020-07-01,000001,Vente,3707.7,,,LE GARANDEAU,B052,85430,85161,Nieul-le-Dolent,85,,,85161000ZX0008,,,,,,,,,,,,,0,,,,,P,prés,,,12340,-1.534039,46.592076
2020-1240500,2020-07-01,000001,Vente,3707.7,,,LES MARMOLIERES,B086,85430,85161,Nieul-le-Dolent,85,,,85161000ZX0014,,,,,,,,,,,,,0,,,,,T,terres,,,6260,-1.527345,46.591474
2020-1240500,2020-07-01,000001,Vente,3707.7,,,LE CHENE VERT,B037,85430,85161,Nieul-le-Dolent,85,,,85161000ZX0101,,,,,,,,,,,,,0,,,,,J,jardins,,,488,-1.527454,46.591889
2020-1240500,2020-07-01,000001,Vente,3707.7,,,LE CHENE VERT,B037,85430,85161,Nieul-le-Dolent,85,,,85161000ZX0102,,,,,,,,,,,,,0,,,,,J,jardins,,,351,-1.52784,46.592004
2020-1240500,2020-07-01,000001,Vente,3707.7,,,LE CHENE VERT,B037,85430,85161,Nieul-le-Dolent,85,,,85161000ZX0103,,,,,,,,,,,,,0,,,,,J,jardins,,,438,-1.527711,46.591795
2020-1240500,2020-07-01,000001,Vente,3707.7,,,LE CHENE VERT,B037,85430,85161,Nieul-le-Dolent,85,,,85161000ZX0105,,,,,,,,,,,,,0,,,,,T,terres,,,1933,-1.528131,46.591801
2020-1240506,2020-07-01,000001,Vente,3576.8,,,LE CHENE VERT,B037,85430,85161,Nieul-le-Dolent,85,,,85161000ZA0106,,,,,,,,,,,,,0,,,,,T,terres,,,21040,-1.52421,46.59577
2020-1240745,2020-07-30,000001,Vente,200000,1,,RUE DU SEMEUR,0428,85430,85161,Nieul-le-Dolent,85,,,85161000AA0179,,,,,,,,,,,,,0,1,Maison,120,5,S,sols,,,970,-1.517821,46.575186
2020-1240844,2020-07-10,000001,Vente,137000,22,,RUE BERTRAND L HOTELLIER,0280,85430,85161,Nieul-le-Dolent,85,,,85161000AD0080,,,,,,,,,,,,,0,4,Local industriel. commercial ou assimilé,130,0,S,sols,,,76,-1.50679,46.573964
2020-1240844,2020-07-10,000001,Vente,137000,22,B,RUE BERTRAND L HOTELLIER,0280,85430,85161,Nieul-le-Dolent,85,,,85161000AD0081,,,,,,,,,,,,,0,4,Local industriel. commercial ou assimilé,35,0,S,sols,,,75,-1.506709,46.57387
2020-1240852,2020-07-27,000001,Vente,34600,9000,F,LA THIBAUDIERE,B129,85430,85161,Nieul-le-Dolent,85,,,85161000ZN0222,,,,,,,,,,,,,0,3,Dépendance,,0,S,sols,,,140,-1.514663,46.562893
2020-1240852,2020-07-27,000001,Vente,34600,,,LA THIBAUDIERE,B129,85430,85161,Nieul-le-Dolent,85,,,85161000ZN0223,,,,,,,,,,,,,0,,,,,S,sols,,,38,-1.514522,46.562884
2020-1240852,2020-07-27,000001,Vente,34600,,,LA THIBAUDIERE,B129,85430,85161,Nieul-le-Dolent,85,,,85161000ZN0224,,,,,,,,,,,,,0,,,,,S,sols,,,7,-1.514483,46.562834
2020-1240852,2020-07-27,000001,Vente,34600,,,LA THIBAUDIERE,B129,85430,85161,Nieul-le-Dolent,85,,,85161000ZN0226,,,,,,,,,,,,,0,,,,,S,sols,,,560,-1.514699,46.563078
2020-1240900,2020-07-24,000002,Vente,120000,32,,RUE HENRI LE POT,0271,85430,85161,Nieul-le-Dolent,85,,,85161000AB0332,,,,,,,,,,,,,0,1,Maison,112,4,S,sols,,,387,-1.510786,46.576976
2020-1240900,2020-07-24,000002,Vente,120000,30,,RUE HENRI LE POT,0271,85430,85161,Nieul-le-Dolent,85,,,85161000AB0334,,,,,,,,,,,,,0,,,,,S,sols,,,332,-1.510835,46.576877
2020-1240998,2020-07-24,000001,Vente,50000,3,,RUE PIERRE GAUTRON,0390,85430,85161,Nieul-le-Dolent,85,,,85161000AB0214,,,,,,,,,,,,,0,1,Maison,86,4,S,sols,,,135,-1.509486,46.574423
2020-1240998,2020-07-24,000001,Vente,50000,,,RUE MAURICE POMPIDOU,0380,85430,85161,Nieul-le-Dolent,85,,,85161000AB0216,,,,,,,,,,,,,0,,,,,S,sols,,,18,-1.509349,46.574373
2020-1241114,2020-08-17,000001,Vente,182000,18,,RUE ARTHUR CHAUVET,0052,85430,85161,Nieul-le-Dolent,85,,,85161000AD0096,,,,,,,,,,,,,0,1,Maison,124,6,S,sols,,,531,-1.5054,46.573585
2020-1241133,2020-07-27,000001,Vente,52806,25,,RUE FLORENCE ARTHAUD,0450,85430,85161,Nieul-le-Dolent,85,,,85161000AA0253,,,,,,,,,,,,,0,,,,,AB,terrains a bâtir,,,677,-1.514425,46.572505
2020-1241134,2020-07-30,000001,Vente,23520,,,BELLEVUE,B008,85430,85161,Nieul-le-Dolent,85,,,85161000ZP0005,,,,,,,,,,,,,0,,,,,J,jardins,,,3260,,
2020-1241134,2020-07-30,000001,Vente,23520,,,BELLEVUE,B008,85430,85161,Nieul-le-Dolent,85,,,85161000ZP0005,,,,,,,,,,,,,0,,,,,S,sols,,,100,,
2020-1241136,2020-07-30,000001,Vente,26684,,,BELLEVUE,B008,85430,85161,Nieul-le-Dolent,85,,,85161000ZP0150,,,,,,,,,,,,,0,,,,,J,jardins,,,3812,,
2020-1241510,2020-08-27,000002,Vente,100,14,,RUE HENRI LE POT,0271,85430,85161,Nieul-le-Dolent,85,,,85161000AB0327,,,,,,,,,,,,,0,,,,,S,sols,,,12,-1.510135,46.575836
2020-1241513,2020-08-31,000001,Vente,61842,9008,,ZA DU VIVIER,A001,85430,85161,Nieul-le-Dolent,85,,,85161000ZR0239,,,,,,,,,,,,,0,4,Local industriel. commercial ou assimilé,5630,0,S,sols,,,2333,-1.516038,46.569187
2020-1241513,2020-08-31,000001,Vente,61842,,,LE VIVIER,B138,85430,85161,Nieul-le-Dolent,85,,,85161000ZR0275,,,,,,,,,,,,,0,,,,,S,sols,,,3289,-1.516526,46.569076
2020-1241597,2020-09-16,000001,Vente,193000,1,,IMP DE VERDUN,0436,85430,85161,Nieul-le-Dolent,85,,,85161000AC0248,,,,,,,,,,,,,0,1,Maison,89,4,S,sols,,,751,-1.49666,46.573778
2020-1241716,2020-08-28,000001,Vente,367200,46,,RUE ARTHUR CHAUVET,0052,85430,85161,Nieul-le-Dolent,85,,,85161000AD0238,,,,,,,,,,,,,0,1,Maison,162,7,S,sols,,,500,-1.501772,46.57216
2020-1241716,2020-08-28,000001,Vente,367200,46,,RUE ARTHUR CHAUVET,0052,85430,85161,Nieul-le-Dolent,85,,,85161000AD0238,,,,,,,,,,,,,0,1,Maison,162,7,AG,terrains d'agrément,,,792,-1.501772,46.57216
2020-1241831,2020-08-14,000001,Vente,130000,5640,,LA JARRIE,B074,85430,85161,Nieul-le-Dolent,85,,,85161000ZH0206,,,,,,,,,,,,,0,1,Maison,72,3,S,sols,,,811,-1.502426,46.550114
2020-1242214,2020-09-09,000001,Vente,71000,26,B,RUE ARTHUR CHAUVET,0052,85430,85161,Nieul-le-Dolent,85,,,85161000AD0130,,,,,,,,,,,,,0,3,Dépendance,,0,J,jardins,,,800,-1.50436,46.573331
2020-1242214,2020-09-09,000001,Vente,71000,26,B,RUE ARTHUR CHAUVET,0052,85430,85161,Nieul-le-Dolent,85,,,85161000AD0130,,,,,,,,,,,,,0,3,Dépendance,,0,S,sols,,,50,-1.50436,46.573331
2020-1242254,2020-09-16,000001,Vente,157000,5036,,PL DE L EGLISE,0200,85430,85161,Nieul-le-Dolent,85,,,85161000AB0239,,,,,,,,,,,,,0,1,Maison,95,5,S,sols,,,188,-1.510001,46.575323
2020-1242254,2020-09-16,000001,Vente,157000,2,,IMP HENRI GUITTON,0267,85430,85161,Nieul-le-Dolent,85,,,85161000AB0305,,,,,,,,,,,,,0,3,Dépendance,,0,S,sols,,,34,-1.509837,46.575347
2020-1242254,2020-09-16,000001,Vente,157000,,,RUE HENRI LE POT,0271,85430,85161,Nieul-le-Dolent,85,,,85161000AB0310,,,,,,,,,,,,,0,,,,,S,sols,,,14,-1.50982,46.575313
2020-1242277,2020-10-07,000001,Vente,220000,9,,RUE HERVE BAZIN,0065,85430,85161,Nieul-le-Dolent,85,,,85161000ZW0161,,,,,,,,,,,,,0,1,Maison,109,4,S,sols,,,600,-1.516939,46.577567
2020-1242369,2020-09-29,000001,Vente,170000,9,,RUE DES PEUPLIERS,0386,85430,85161,Nieul-le-Dolent,85,,,85161000AD0208,,,,,,,,,,,,,0,1,Maison,83,4,S,sols,,,600,-1.505667,46.571238
2020-1242660,2020-10-26,000001,Vente,256000,10,,IMP DU CHATEAU,0111,85430,85161,Nieul-le-Dolent,85,,,85161000AC0074,,,,,,,,,,,,,0,1,Maison,112,4,S,sols,,,752,-1.499701,46.575978
2020-1242759,2020-10-10,000001,Vente,208000,506,,LA MARTINIERE,B087,85430,85161,Nieul-le-Dolent,85,,,85161000ZD0043,,,,,,,,,,,,,0,1,Maison,81,4,S,sols,,,1200,-1.505204,46.568088
2020-1242759,2020-10-10,000001,Vente,208000,506,,LA MARTINIERE,B087,85430,85161,Nieul-le-Dolent,85,,,85161000ZD0043,,,,,,,,,,,,,0,1,Maison,54,2,S,sols,,,1200,-1.505204,46.568088
2020-1242759,2020-10-10,000001,Vente,208000,506,,LA MARTINIERE,B087,85430,85161,Nieul-le-Dolent,85,,,85161000ZD0043,,,,,,,,,,,,,0,1,Maison,54,2,AG,terrains d'agrément,,,1210,-1.505204,46.568088
2020-1242759,2020-10-10,000001,Vente,208000,506,,LA MARTINIERE,B087,85430,85161,Nieul-le-Dolent,85,,,85161000ZD0043,,,,,,,,,,,,,0,1,Maison,81,4,AG,terrains d'agrément,,,1210,-1.505204,46.568088
2020-1242759,2020-10-10,000001,Vente,208000,506,,LA MARTINIERE,B087,85430,85161,Nieul-le-Dolent,85,,,85161000ZD0043,,,,,,,,,,,,,0,1,Maison,81,4,J,jardins,,,5560,-1.505204,46.568088
2020-1242759,2020-10-10,000001,Vente,208000,506,,LA MARTINIERE,B087,85430,85161,Nieul-le-Dolent,85,,,85161000ZD0043,,,,,,,,,,,,,0,1,Maison,54,2,J,jardins,,,5560,-1.505204,46.568088
2020-1242973,2020-10-09,000001,Vente,45000,32,,RUE HENRI LE POT,0271,85430,85161,Nieul-le-Dolent,85,,,85161000AB0333,,,,,,,,,,,,,0,,,,,AB,terrains a bâtir,,,175,-1.510474,46.576959
2020-1242973,2020-10-09,000001,Vente,45000,30,,RUE HENRI LE POT,0271,85430,85161,Nieul-le-Dolent,85,,,85161000AB0335,,,,,,,,,,,,,0,,,,,AB,terrains a bâtir,,,474,-1.510695,46.576805
2020-1243236,2020-10-30,000002,Vente,29400,16,,RUE DE LA POSTE,0395,85430,85161,Nieul-le-Dolent,85,,,85161000AB0338,,,,,,,,,,,,,0,,,,,AB,terrains a bâtir,,,350,-1.5127,46.575786
2020-1243315,2020-10-26,000001,Vente,150000,5309,,LA VERGNE,B134,85430,85161,Nieul-le-Dolent,85,,,85161000ZK0115,,,,,,,,,,,,,0,1,Maison,75,3,S,sols,,,451,-1.529183,46.547801
2020-1243315,2020-10-26,000001,Vente,150000,,,LA VERGNE,B134,85430,85161,Nieul-le-Dolent,85,,,85161000ZK0143,,,,,,,,,,,,,0,,,,,J,jardins,,,282,-1.528844,46.54779
2020-1243321,2020-10-30,000001,Vente,335000,8,,IMP BELLEVUE,0070,85430,85161,Nieul-le-Dolent,85,,,85161000AD0225,,,,,,,,,,,,,0,1,Maison,128,4,S,sols,,,1000,-1.509325,46.570351
2020-1243321,2020-10-30,000001,Vente,335000,8,,IMP BELLEVUE,0070,85430,85161,Nieul-le-Dolent,85,,,85161000AD0225,,,,,,,,,,,,,0,1,Maison,128,4,AG,terrains d'agrément,,,928,-1.509325,46.570351
2020-1243354,2020-10-27,000001,Vente,206000,,,LA PORTE,B108,85430,85161,Nieul-le-Dolent,85,,,85161000ZB0034,,,,,,,,,,,,,0,,,,,T,terres,,,70,-1.510471,46.591036
2020-1243354,2020-10-27,000001,Vente,206000,8,,LA GIRAUDIERE,B058,85430,85161,Nieul-le-Dolent,85,,,85161000ZB0037,,,,,,,,,,,,,0,1,Maison,117,3,S,sols,,,1430,-1.510481,46.590858
2020-1243381,2020-11-20,000001,Vente,185000,5386,,ORDREVILLE,B095,85430,85161,Nieul-le-Dolent,85,,,85161000ZB0044,,,,,,,,,,,,,0,1,Maison,100,3,S,sols,,,1173,-1.499448,46.582853
2020-1243588,2020-11-05,000001,Vente,837123,13,,RUE DES ARDENNES,0061,85430,85161,Nieul-le-Dolent,85,,,85161000AC0258,,,,,,,,,,,,,0,1,Maison,98,5,S,sols,,,758,-1.497089,46.574643
2020-1243700,2020-11-20,000001,Vente,63000,16,,RUE DE LA POSTE,0395,85430,85161,Nieul-le-Dolent,85,,,85161000AB0337,,,,,,,,,,,,,0,,,,,AB,terrains a bâtir,,,750,-1.512913,46.575848
2020-1243816,2020-11-23,000001,Vente,47268,33,,RUE FLORENCE ARTHAUD,0450,85430,85161,Nieul-le-Dolent,85,,,85161000AA0270,,,,,,,,,,,,,0,,,,,AB,terrains a bâtir,,,606,-1.51402,46.57202
2020-1243839,2020-11-25,000001,Vente,175000,2,,IMP DES SUREAUX,0431,85430,85161,Nieul-le-Dolent,85,,,85161000AD0182,,,,,,,,,,,,,0,1,Maison,80,4,S,sols,,,723,-1.504767,46.57104
2020-1243866,2020-11-18,000001,Vente,30000,,,LE CHAMP DES VACHES,B028,85430,85161,Nieul-le-Dolent,85,,,85161000ZR0213,,,,,,,,,,,,,0,,,,,E,eaux,,,2760,-1.524955,46.569494
2020-1243866,2020-11-18,000001,Vente,30000,,,LE CHAMP DES VACHES,B028,85430,85161,Nieul-le-Dolent,85,,,85161000ZR0213,,,,,,,,,,,,,0,,,,,BF,futaies feuillues,,,1635,-1.524955,46.569494
2020-1244189,2020-12-16,000001,Vente,150000,5,,RUE AGENOR RAVON,0020,85430,85161,Nieul-le-Dolent,85,,,85161000AD0045,,,,,,,,,,,,,0,1,Maison,69,3,S,sols,,,525,-1.508301,46.573231
2020-1244201,2020-12-16,000001,Vente,252000,1,,LE CHENE VERT,B037,85430,85161,Nieul-le-Dolent,85,,,85161000ZX0110,,,,,,,,,,,,,0,3,Dépendance,,0,S,sols,,,500,-1.528421,46.592563
2020-1244201,2020-12-16,000001,Vente,252000,1,,LE CHENE VERT,B037,85430,85161,Nieul-le-Dolent,85,,,85161000ZX0110,,,,,,,,,,,,,0,3,Dépendance,,0,AG,terrains d'agrément,,,1471,-1.528421,46.592563
2020-1244201,2020-12-16,000001,Vente,252000,1,,LE CHENE VERT,B037,85430,85161,Nieul-le-Dolent,85,,,85161000ZX0110,,,,,,,,,,,,,0,1,Maison,101,5,AG,terrains d'agrément,,,1471,-1.528421,46.592563
2020-1244201,2020-12-16,000001,Vente,252000,1,,LE CHENE VERT,B037,85430,85161,Nieul-le-Dolent,85,,,85161000ZX0110,,,,,,,,,,,,,0,1,Maison,85,5,AG,terrains d'agrément,,,1471,-1.528421,46.592563
2020-1244201,2020-12-16,000001,Vente,252000,1,,LE CHENE VERT,B037,85430,85161,Nieul-le-Dolent,85,,,85161000ZX0110,,,,,,,,,,,,,0,1,Maison,101,5,S,sols,,,500,-1.528421,46.592563
2020-1244201,2020-12-16,000001,Vente,252000,1,,LE CHENE VERT,B037,85430,85161,Nieul-le-Dolent,85,,,85161000ZX0110,,,,,,,,,,,,,0,1,Maison,85,5,S,sols,,,500,-1.528421,46.592563
2020-1244344,2020-12-10,000001,Vente,210000,7,,RUE HERVE BAZIN,0065,85430,85161,Nieul-le-Dolent,85,,,85161000ZW0160,,,,,,,,,,,,,0,1,Maison,87,4,S,sols,,,567,-1.516669,46.577471