id_mutation,date_mutation,numero_disposition,nature_mutation,valeur_fonciere,adresse_numero,adresse_suffixe,adresse_nom_voie,adresse_code_voie,code_postal,code_commune,nom_commune,code_departement,ancien_code_commune,ancien_nom_commune,id_parcelle,ancien_id_parcelle,numero_volume,lot1_numero,lot1_surface_carrez,lot2_numero,lot2_surface_carrez,lot3_numero,lot3_surface_carrez,lot4_numero,lot4_surface_carrez,lot5_numero,lot5_surface_carrez,nombre_lots,code_type_local,type_local,surface_reelle_bati,nombre_pieces_principales,code_nature_culture,nature_culture,code_nature_culture_speciale,nature_culture_speciale,surface_terrain,longitude,latitude
2020-1232774,2020-01-22,000001,Vente,2411.5,,,VERGER DU BEAUPRE,B386,85120,85264,Saint-Pierre-du-Chemin,85,,,852640000C0343,,,,,,,,,,,,,0,,,,,J,jardins,,,410,-0.665818,46.710023
2020-1232774,2020-01-22,000001,Vente,2411.5,,,VERGER DU BEAUPRE,B386,85120,85264,Saint-Pierre-du-Chemin,85,,,852640000C0344,,,,,,,,,,,,,0,,,,,T,terres,,,710,-0.665908,46.709932
2020-1232774,2020-01-22,000001,Vente,2411.5,,,VERGER DU BEAUPRE,B386,85120,85264,Saint-Pierre-du-Chemin,85,,,852640000C0346,,,,,,,,,,,,,0,,,,,T,terres,,,1200,-0.665397,46.709959
2020-1232774,2020-01-22,000001,Vente,2411.5,,,VERGER DU BEAUPRE,B386,85120,85264,Saint-Pierre-du-Chemin,85,,,852640000C0347,,,,,,,,,,,,,0,,,,,J,jardins,,,130,-0.665241,46.70997
2020-1232774,2020-01-22,000001,Vente,2411.5,,,LE PLANTURANTIN,B295,85120,85264,Saint-Pierre-du-Chemin,85,,,852640000C0371,,,,,,,,,,,,,0,,,,,T,terres,,,4440,-0.67098,46.710865
2020-1232853,2020-01-30,000001,Vente,90000,14,,RUE DES THERMES,0121,85120,85264,Saint-Pierre-du-Chemin,85,,,85264000AB0048,,,,,,,,,,,,,0,1,Maison,100,3,S,sols,,,500,-0.703065,46.696385
2020-1232853,2020-01-30,000001,Vente,90000,,,LE BOURG,B052,85120,85264,Saint-Pierre-du-Chemin,85,,,85264000AB0049,,,,,,,,,,,,,0,,,,,J,jardins,,,1070,-0.702829,46.696704
2020-1232917,2020-01-17,000001,Vente,130000,5659,F,RUE DE LA TOUR,0122,85120,85264,Saint-Pierre-du-Chemin,85,,,85264000AB0699,,,,,,,,,,,,,0,1,Maison,88,3,S,sols,,,898,-0.700032,46.694612
2020-1233060,2020-02-05,000001,Vente,57.75,,,LE COUDREAU,B135,85120,85264,Saint-Pierre-du-Chemin,85,,,852640000C0360,,,,,,,,,,,,,0,,,,,J,jardins,,,165,-0.66681,46.71004
2020-1233061,2020-02-05,000001,Vente,656.25,,,LE COUDREAU,B135,85120,85264,Saint-Pierre-du-Chemin,85,,,852640000C0358,,,,,,,,,,,,,0,,,,,T,terres,,,1615,-0.666642,46.710017
2020-1233061,2020-02-05,000001,Vente,656.25,,,LE COUDREAU,B135,85120,85264,Saint-Pierre-du-Chemin,85,,,852640000C0359,,,,,,,,,,,,,0,,,,,J,jardins,,,230,-0.66682,46.710121
2020-1233061,2020-02-05,000001,Vente,656.25,,,LE COUDREAU,B135,85120,85264,Saint-Pierre-du-Chemin,85,,,852640000C1050,,,,,,,,,,,,,0,,,,,T,terres,,,30,-0.667024,46.710152
2020-1233355,2020-02-25,000001,Vente,17253,46,,RUE DES SAULNIERS,0116,85120,85264,Saint-Pierre-du-Chemin,85,,,852640000C1449,,,,,,,,,,,,,0,,,,,AB,terrains a bâtir,,,639,-0.696027,46.69504
2020-1233421,2020-03-06,000001,Vente,95000,6,,LA GAUVINIERE,B174,85120,85264,Saint-Pierre-du-Chemin,85,,,852640000A1130,,,,,,,,,,,,,0,1,Maison,97,4,S,sols,,,455,-0.748554,46.706139
2020-1233421,2020-03-06,000001,Vente,95000,,,LA GAUVINIERE,B174,85120,85264,Saint-Pierre-du-Chemin,85,,,852640000A1444,,,,,,,,,,,,,0,,,,,T,terres,,,205,-0.748431,46.706333
2020-1233421,2020-03-06,000001,Vente,95000,,,LA GAUVINIERE,B174,85120,85264,Saint-Pierre-du-Chemin,85,,,852640000A1448,,,,,,,,,,,,,0,,,,,S,sols,,,1059,-0.748398,46.706098
2020-1233474,2020-03-02,000001,Vente,43900,,,LA CHARNERIE,B114,85120,85264,Saint-Pierre-du-Chemin,85,,,852640000D0264,,,,,,,,,,,,,0,,,,,T,terres,,,15418,-0.70168,46.677006
2020-1233474,2020-03-02,000001,Vente,43900,,,LA CHARNERIE,B114,85120,85264,Saint-Pierre-du-Chemin,85,,,852640000D0264,,,,,,,,,,,,,0,,,,,S,sols,,,2862,-0.70168,46.677006
2020-1233475,2020-03-02,000002,Vente,6100,,,L AUBEPIN,B011,85120,85264,Saint-Pierre-du-Chemin,85,,,852640000D0256,,,,,,,,,,,,,0,,,,,T,terres,,,14600,-0.700487,46.67791
2020-1233475,2020-03-02,000002,Vente,6100,,,L AUBEPIN,B011,85120,85264,Saint-Pierre-du-Chemin,85,,,852640000D0257,,,,,,,,,,,,,0,,,,,VI,vignes,,,1080,-0.700045,46.678853
2020-1233475,2020-03-02,000002,Vente,6100,,,LA POPINIERE PAPIN,B305,85120,85264,Saint-Pierre-du-Chemin,85,,,852640000D0293,,,,,,,,,,,,,0,,,,,P,prés,,,7620,-0.701607,46.67609
2020-1233475,2020-03-02,000002,Vente,6100,,,L AUBIER,B012,85120,85264,Saint-Pierre-du-Chemin,85,,,852640000D0306,,,,,,,,,,,,,0,,,,,P,prés,,,1100,-0.699372,46.673577
2020-1233512,2020-03-11,000001,Vente,88000,24,,RUE DES THERMES,0121,85120,85264,Saint-Pierre-du-Chemin,85,,,85264000AB0725,,,,,,,,,,,,,0,1,Maison,79,3,S,sols,,,805,-0.703996,46.696633
2020-1234050,2020-06-16,000001,Vente,90000,5665,F,RUE PIERRE BRESSUIRE,0103,85120,85264,Saint-Pierre-du-Chemin,85,,,852640000B1291,,,,,,,,,,,,,0,4,Local industriel. commercial ou assimilé,378,0,S,sols,,,1804,,
2020-1234132,2020-06-09,000001,Vente,87000,,,LA MAISON BARREE,B228,85120,85264,Saint-Pierre-du-Chemin,85,,,85264000AB0543,,,,,,,,,,,,,0,,,,,S,sols,,,337,-0.70367,46.693018
2020-1234132,2020-06-09,000001,Vente,87000,,,LE BOURG NEUF,B053,85120,85264,Saint-Pierre-du-Chemin,85,,,85264000AB0550,,,,,,,,,,,,,0,,,,,J,jardins,,,96,-0.703474,46.693043
2020-1234132,2020-06-09,000001,Vente,87000,,,LE BOURG NEUF,B053,85120,85264,Saint-Pierre-du-Chemin,85,,,85264000AB0553,,,,,,,,,,,,,0,,,,,J,jardins,,,221,-0.703529,46.692965
2020-1234132,2020-06-09,000001,Vente,87000,5627,,CHE DE BOURG NEUF,0020,85120,85264,Saint-Pierre-du-Chemin,85,,,85264000AB0591,,,,,,,,,,,,,0,1,Maison,62,3,S,sols,,,521,-0.703224,46.692909
2020-1234132,2020-06-09,000001,Vente,87000,,,LE BOURG,B052,85120,85264,Saint-Pierre-du-Chemin,85,,,85264000AB0594,,,,,,,,,,,,,0,,,,,J,jardins,,,38,-0.703076,46.692915
2020-1234178,2020-06-12,000001,Vente,24000,,,L HERSE,B209,85120,85264,Saint-Pierre-du-Chemin,85,,,852640000D0924,,,,,,,,,,,,,0,,,,,T,terres,,,4705,-0.669073,46.673599
2020-1234178,2020-06-12,000001,Vente,24000,,,L HERSE,B209,85120,85264,Saint-Pierre-du-Chemin,85,,,852640000D0925,,,,,,,,,,,,,0,,,,,P,prés,,,20525,-0.666778,46.672749
2020-1234178,2020-06-12,000001,Vente,24000,,,LE PRE DE LA FONTAINE,B320,85120,85264,Saint-Pierre-du-Chemin,85,,,852640000D0926,,,,,,,,,,,,,0,,,,,P,prés,,,980,-0.666937,46.671672
2020-1234178,2020-06-12,000001,Vente,24000,,,LE PRE DE LA FONTAINE,B320,85120,85264,Saint-Pierre-du-Chemin,85,,,852640000D0927,,,,,,,,,,,,,0,,,,,P,prés,,,5670,-0.667782,46.670944
2020-1234178,2020-06-12,000001,Vente,24000,,,LE PRE DE LA FONTAINE,B320,85120,85264,Saint-Pierre-du-Chemin,85,,,852640000D0928,,,,,,,,,,,,,0,,,,,P,prés,,,1760,-0.668232,46.670554
2020-1234178,2020-06-12,000001,Vente,24000,,,LE PRE DE LA FONTAINE,B320,85120,85264,Saint-Pierre-du-Chemin,85,,,852640000D0929,,,,,,,,,,,,,0,,,,,E,eaux,,,1020,-0.668107,46.670235
2020-1234178,2020-06-12,000001,Vente,24000,,,LE PRE DE LA FONTAINE,B320,85120,85264,Saint-Pierre-du-Chemin,85,,,852640000D0930,,,,,,,,,,,,,0,,,,,P,prés,,,1900,-0.668733,46.66976
2020-1234178,2020-06-12,000001,Vente,24000,,,LE PRE DE LA FONTAINE,B320,85120,85264,Saint-Pierre-du-Chemin,85,,,852640000D0931,,,,,,,,,,,,,0,,,,,P,prés,,,14120,-0.670046,46.669043
2020-1234178,2020-06-12,000001,Vente,24000,,,LE GAT,B173,85120,85264,Saint-Pierre-du-Chemin,85,,,852640000D0986,,,,,,,,,,,,,0,,,,,T,terres,,,6650,-0.669015,46.669949
2020-1234178,2020-06-12,000001,Vente,24000,,,LE GAT,B173,85120,85264,Saint-Pierre-du-Chemin,85,,,852640000D0989,,,,,,,,,,,,,0,,,,,T,terres,,,24620,-0.668058,46.672564
2020-1234222,2020-06-09,000001,Vente,151000,5418,,LA PLENELIERE,B297,85120,85264,Saint-Pierre-du-Chemin,85,,,852640000D1207,,,,,,,,,,,,,0,1,Maison,155,4,S,sols,,,2662,-0.699414,46.677
2020-1234335,2020-07-06,000001,Vente,105000,6,,RUE DU PRE NEUF,0105,85120,85264,Saint-Pierre-du-Chemin,85,,,852640000B0992,,,,,,,,,,,,,0,1,Maison,78,3,S,sols,,,863,-0.705808,46.693106
2020-1234445,2020-07-01,000002,Vente,360,,,LE BOURG,B052,85120,85264,Saint-Pierre-du-Chemin,85,,,85264000AB0911,,,,,,,,,,,,,0,,,,,J,jardins,,,196,-0.700594,46.695666
2020-1234445,2020-07-01,000002,Vente,360,,,LE BOURG,B052,85120,85264,Saint-Pierre-du-Chemin,85,,,85264000AB0915,,,,,,,,,,,,,0,,,,,J,jardins,,,22,-0.70071,46.695601
2020-1234445,2020-07-01,000002,Vente,360,,,LE BOURG,B052,85120,85264,Saint-Pierre-du-Chemin,85,,,85264000AB0918,,,,,,,,,,,,,0,,,,,S,sols,,,22,-0.701067,46.695651
2020-1234449,2020-07-01,000001,Vente,396000,,,LE BOURG,B052,85120,85264,Saint-Pierre-du-Chemin,85,,,85264000AB0916,,,,,,,,,,,,,0,,,,,S,sols,,,208,-0.701061,46.695758
2020-1234449,2020-07-01,000001,Vente,396000,,,LE BOURG,B052,85120,85264,Saint-Pierre-du-Chemin,85,,,85264000AB0918,,,,,,,,,,,,,0,,,,,S,sols,,,22,-0.701067,46.695651
2020-1234498,2020-07-25,000001,Vente,50000,,,LE BOURG,B052,85120,85264,Saint-Pierre-du-Chemin,85,,,85264000AB0501,,,,,,,,,,,,,0,,,,,S,sols,,,20,-0.703386,46.693813
2020-1234498,2020-07-25,000001,Vente,50000,60,,RUE DES COMTES D'ASNIERES,0032,85120,85264,Saint-Pierre-du-Chemin,85,,,85264000AB0504,,,,,,,,,,,,,0,1,Maison,115,4,S,sols,,,328,-0.703571,46.693783
2020-1234618,2020-08-04,000001,Vente,54000,2,,RUE DES THERMES,0121,85120,85264,Saint-Pierre-du-Chemin,85,,,85264000AB0513,,,,,,,,,,,,,0,1,Maison,78,5,S,sols,,,260,-0.70204,46.695536
2020-1234802,2020-08-10,000001,Vente,64000,,,LA PLOCHERE,B299,85120,85264,Saint-Pierre-du-Chemin,85,,,852640000D1337,,,,,,,,,,,,,0,,,,,S,sols,,,90,-0.706608,46.689443
2020-1234802,2020-08-10,000001,Vente,64000,,,LA PLOCHERE,B299,85120,85264,Saint-Pierre-du-Chemin,85,,,852640000D1338,,,,,,,,,,,,,0,,,,,S,sols,,,705,-0.706723,46.689321
2020-1234802,2020-08-10,000001,Vente,64000,31,A,RUE DES PLOCHERES,0104,85120,85264,Saint-Pierre-du-Chemin,85,,,852640000D1339,,,,,,,,,,,,,0,3,Dépendance,,0,S,sols,,,400,-0.706536,46.689516
2020-1234802,2020-08-10,000001,Vente,64000,31,,RUE DES PLOCHERES,0104,85120,85264,Saint-Pierre-du-Chemin,85,,,852640000D1340,,,,,,,,,,,,,0,1,Maison,77,5,S,sols,,,500,-0.70641,46.68979
2020-1234919,2020-09-01,000001,Vente,123000,,,LE BOURG,B052,85120,85264,Saint-Pierre-du-Chemin,85,,,85264000AB0801,,,,,,,,,,,,,0,,,,,J,jardins,,,255,-0.701584,46.696123
2020-1234919,2020-09-01,000001,Vente,123000,,,LE BOURG,B052,85120,85264,Saint-Pierre-du-Chemin,85,,,85264000AB0849,,,,,,,,,,,,,0,,,,,S,sols,,,34,-0.701229,46.695902
2020-1234919,2020-09-01,000001,Vente,123000,14,,RUE DES COMTES D'ASNIERES,0032,85120,85264,Saint-Pierre-du-Chemin,85,,,85264000AB0859,,,,,,,,,,,,,0,1,Maison,126,4,S,sols,,,387,-0.70138,46.69606
2020-1234919,2020-09-01,000001,Vente,123000,14,,RUE DES COMTES D'ASNIERES,0032,85120,85264,Saint-Pierre-du-Chemin,85,,,85264000AB0859,,,,,,,,,,,,,0,4,Local industriel. commercial ou assimilé,32,0,S,sols,,,387,-0.70138,46.69606
2020-1234969,2020-08-31,000001,Vente,109000,5090,,RUE DU BOURGNEUF,0021,85120,85264,Saint-Pierre-du-Chemin,85,,,85264000AB0350,,,,,,,,,,,,,0,3,Dépendance,,0,S,sols,,,60,-0.704644,46.691951
2020-1234969,2020-08-31,000001,Vente,109000,27,,RUE DU BOURGNEUF,0021,85120,85264,Saint-Pierre-du-Chemin,85,,,85264000AB0351,,,,,,,,,,,,,0,3,Dépendance,,0,S,sols,,,897,-0.704567,46.691861
2020-1234969,2020-08-31,000001,Vente,109000,27,,RUE DU BOURGNEUF,0021,85120,85264,Saint-Pierre-du-Chemin,85,,,85264000AB0351,,,,,,,,,,,,,0,2,Appartement,40,2,S,sols,,,897,-0.704567,46.691861
2020-1234969,2020-08-31,000001,Vente,109000,27,,RUE DU BOURGNEUF,0021,85120,85264,Saint-Pierre-du-Chemin,85,,,85264000AB0351,,,,,,,,,,,,,0,2,Appartement,97,6,S,sols,,,897,-0.704567,46.691861
2020-1235487,2020-10-06,000001,Vente,20000,2,,RUE DE LA PACAUDIERE,0099,85120,85264,Saint-Pierre-du-Chemin,85,,,85264000AB0130,,,,,,,,,,,,,0,1,Maison,122,6,S,sols,,,145,-0.70113,46.697191
2020-1235487,2020-10-06,000001,Vente,20000,2,,RUE DE LA PACAUDIERE,0099,85120,85264,Saint-Pierre-du-Chemin,85,,,85264000AB0130,,,,,,,,,,,,,0,4,Local industriel. commercial ou assimilé,,0,S,sols,,,145,-0.70113,46.697191
2020-1235487,2020-10-06,000001,Vente,20000,,,LE BOURG,B052,85120,85264,Saint-Pierre-du-Chemin,85,,,85264000AB0888,,,,,,,,,,,,,0,,,,,S,sols,,,114,-0.701201,46.697218
2020-1235601,2020-10-22,000001,Vente,88000,5416,,LA POPINIERE PAPIN,B305,85120,85264,Saint-Pierre-du-Chemin,85,,,852640000D0996,,,,,,,,,,,,,0,1,Maison,107,6,S,sols,,,3970,-0.703153,46.676562
2020-1235601,2020-10-22,000001,Vente,88000,,,LA POPINIERE PAPIN,B305,85120,85264,Saint-Pierre-du-Chemin,85,,,852640000D0997,,,,,,,,,,,,,0,,,,,J,jardins,,,570,-0.703142,46.676288
2020-1235746,2020-10-30,000001,Vente,125000,5109,,LA GRATELIERE,B199,85120,85264,Saint-Pierre-du-Chemin,85,,,852640000A1097,,,,,,,,,,,,,0,1,Maison,97,4,S,sols,,,880,-0.740189,46.689756
2020-1235860,2020-10-30,000001,Vente,180000,,,LES BRIANTIERES,B058,85120,85264,Saint-Pierre-du-Chemin,85,,,852640000A0896,,,,,,,,,,,,,0,,,,,S,sols,,,65,-0.725973,46.699316
2020-1235860,2020-10-30,000001,Vente,180000,,,LES BRIANTIERES,B058,85120,85264,Saint-Pierre-du-Chemin,85,,,852640000A0899,,,,,,,,,,,,,0,,,,,T,terres,,,1646,-0.725507,46.699017
2020-1235860,2020-10-30,000001,Vente,180000,5055,,LES BRIANTIERES,B058,85120,85264,Saint-Pierre-du-Chemin,85,,,852640000A1195,,,,,,,,,,,,,0,1,Maison,108,4,S,sols,,,129,-0.725877,46.699431
2020-1235860,2020-10-30,000001,Vente,180000,,,LES BRIANTIERES,B058,85120,85264,Saint-Pierre-du-Chemin,85,,,852640000A1196,,,,,,,,,,,,,0,,,,,S,sols,,,158,-0.725827,46.699376
2020-1235860,2020-10-30,000001,Vente,180000,5468,,LES BRIANTIERES,B058,85120,85264,Saint-Pierre-du-Chemin,85,,,852640000A1197,,,,,,,,,,,,,0,1,Maison,127,5,S,sols,,,266,-0.725702,46.699278
2020-1235860,2020-10-30,000001,Vente,180000,,,LES BRIANTIERES,B058,85120,85264,Saint-Pierre-du-Chemin,85,,,852640000A1198,,,,,,,,,,,,,0,,,,,S,sols,,,75,-0.72559,46.699211
2020-1235860,2020-10-30,000001,Vente,180000,,,LES BRIANTIERES,B058,85120,85264,Saint-Pierre-du-Chemin,85,,,852640000A1199,,,,,,,,,,,,,0,,,,,S,sols,,,58,-0.725549,46.69917
2020-1235860,2020-10-30,000001,Vente,180000,,,LES BRIANTIERES,B058,85120,85264,Saint-Pierre-du-Chemin,85,,,852640000A1200,,,,,,,,,,,,,0,,,,,S,sols,,,118,-0.725717,46.699128
2020-1235860,2020-10-30,000001,Vente,180000,5201,,LES BRIANTIERES,B058,85120,85264,Saint-Pierre-du-Chemin,85,,,852640000A1201,,,,,,,,,,,,,0,3,Dépendance,,0,S,sols,,,1126,-0.725968,46.699088
2020-1235860,2020-10-30,000001,Vente,180000,,,LES BRIANTIERES,B058,85120,85264,Saint-Pierre-du-Chemin,85,,,852640000A1202,,,,,,,,,,,,,0,,,,,J,jardins,,,510,-0.725783,46.69906
2020-1235860,2020-10-30,000001,Vente,180000,,,LES BRIANTIERES,B058,85120,85264,Saint-Pierre-du-Chemin,85,,,852640000A1203,,,,,,,,,,,,,0,,,,,J,jardins,,,510,-0.725967,46.698779
2020-1235916,2020-11-25,000001,Vente,137000,,,LA MIGNONNIERE,B241,85120,85264,Saint-Pierre-du-Chemin,85,,,852640000B0131,,,,,,,,,,,,,0,,,,,S,sols,,,1660,-0.681465,46.719065
2020-1235916,2020-11-25,000001,Vente,137000,5,,LA MIGNONNIERE,B241,85120,85264,Saint-Pierre-du-Chemin,85,,,852640000B0132,,,,,,,,,,,,,0,1,Maison,150,4,S,sols,,,840,-0.681327,46.719073
2020-1235916,2020-11-25,000001,Vente,137000,,,LA MIGNONNIERE,B241,85120,85264,Saint-Pierre-du-Chemin,85,,,852640000B0134,,,,,,,,,,,,,0,,,,,T,terres,,,1080,-0.681475,46.718624
2020-1235916,2020-11-25,000001,Vente,137000,,,LA MIGNONNIERE,B241,85120,85264,Saint-Pierre-du-Chemin,85,,,852640000B0134,,,,,,,,,,,,,0,,,,,S,sols,,,60,-0.681475,46.718624
2020-1235916,2020-11-25,000001,Vente,137000,,,LA MIGNONNIERE,B241,85120,85264,Saint-Pierre-du-Chemin,85,,,852640000B0141,,,,,,,,,,,,,0,,,,,T,terres,,,870,-0.680622,46.718517
2020-1235916,2020-11-25,000001,Vente,137000,,,LA MIGNONNIERE,B241,85120,85264,Saint-Pierre-du-Chemin,85,,,852640000B0142,,,,,,,,,,,,,0,,,,,T,terres,,,8580,-0.681174,46.718226
2020-1235916,2020-11-25,000001,Vente,137000,,,LA MIGNONNIERE,B241,85120,85264,Saint-Pierre-du-Chemin,85,,,852640000B0143,,,,,,,,,,,,,0,,,,,T,terres,,,2125,-0.682123,46.718273
2020-1235916,2020-11-25,000001,Vente,137000,,,LA MIGNONNIERE,B241,85120,85264,Saint-Pierre-du-Chemin,85,,,852640000B0144,,,,,,,,,,,,,0,,,,,T,terres,,,1495,-0.682057,46.718733
2020-1235916,2020-11-25,000001,Vente,137000,,,LA MIGNONNIERE,B241,85120,85264,Saint-Pierre-du-Chemin,85,,,852640000B1218,,,,,,,,,,,,,0,,,,,S,sols,,,42,-0.681223,46.718889
2020-1235916,2020-11-25,000001,Vente,137000,,,LA MIGNONNIERE,B241,85120,85264,Saint-Pierre-du-Chemin,85,,,852640000B1219,,,,,,,,,,,,,0,,,,,S,sols,,,78,-0.68146,46.719269
2020-1235916,2020-11-25,000001,Vente,137000,,,LA MIGNONNIERE,B241,85120,85264,Saint-Pierre-du-Chemin,85,,,852640000B1258,,,,,,,,,,,,,0,,,,,L,landes,,,141,-0.681603,46.719775
2020-1235916,2020-11-25,000001,Vente,137000,,,LA MIGNONNIERE,B241,85120,85264,Saint-Pierre-du-Chemin,85,,,852640000B1260,,,,,,,,,,,,,0,,,,,AG,terrains d'agrément,SPORT,Terrain de sport,1120,-0.68153,46.719453
2020-1236003,2020-11-23,000002,Vente,26766.67,,,LES RIMBRETIERES,B345,85120,85264,Saint-Pierre-du-Chemin,85,,,852640000B0749,,,,,,,,,,,,,0,,,,,P,prés,,,4590,-0.720948,46.688471
2020-1236003,2020-11-23,000002,Vente,26766.67,,,LES RIMBRETIERES,B345,85120,85264,Saint-Pierre-du-Chemin,85,,,852640000B0749,,,,,,,,,,,,,0,,,,,P,prés,,,4590,-0.720948,46.688471
2020-1236003,2020-11-23,000002,Vente,26766.67,,,LES RIMBRETIERES,B345,85120,85264,Saint-Pierre-du-Chemin,85,,,852640000B0750,,,,,,,,,,,,,0,,,,,T,terres,,,6000,-0.720145,46.689176
2020-1236003,2020-11-23,000002,Vente,26766.67,,,LES RIMBRETIERES,B345,85120,85264,Saint-Pierre-du-Chemin,85,,,852640000B0756,,,,,,,,,,,,,0,,,,,L,landes,,,870,-0.717902,46.691896
2020-1236003,2020-11-23,000002,Vente,26766.67,,,LES RIMBRETIERES,B345,85120,85264,Saint-Pierre-du-Chemin,85,,,852640000B0758,,,,,,,,,,,,,0,,,,,VI,vignes,,,3330,-0.717919,46.691639
2020-1236003,2020-11-23,000002,Vente,26766.67,,,LES RIMBRETIERES,B345,85120,85264,Saint-Pierre-du-Chemin,85,,,852640000B0759,,,,,,,,,,,,,0,,,,,T,terres,,,3270,-0.718296,46.691208
2020-1236003,2020-11-23,000002,Vente,26766.67,,,LA TERRE ROUGE,B371,85120,85264,Saint-Pierre-du-Chemin,85,,,852640000B0797,,,,,,,,,,,,,0,,,,,T,terres,,,5665,-0.712306,46.685947
2020-1236003,2020-11-23,000002,Vente,26766.67,,,LA TERRE ROUGE,B371,85120,85264,Saint-Pierre-du-Chemin,85,,,852640000B0798,,,,,,,,,,,,,0,,,,,T,terres,,,6900,-0.713132,46.685245
2020-1236003,2020-11-23,000002,Vente,26766.67,,,LA TERRE ROUGE,B371,85120,85264,Saint-Pierre-du-Chemin,85,,,852640000B0801,,,,,,,,,,,,,0,,,,,T,terres,,,9500,-0.71332,46.684511
2020-1236003,2020-11-23,000002,Vente,26766.67,,,LA CAILLERE,B069,85120,85264,Saint-Pierre-du-Chemin,85,,,852640000B0821,,,,,,,,,,,,,0,,,,,T,terres,,,7500,-0.713287,46.686642
2020-1236003,2020-11-23,000002,Vente,26766.67,,,LA TERRE ROUGE,B371,85120,85264,Saint-Pierre-du-Chemin,85,,,852640000B0822,,,,,,,,,,,,,0,,,,,T,terres,,,7900,-0.712254,46.687109
2020-1236003,2020-11-23,000002,Vente,26766.67,,,LE BEUGNON,B031,85120,85264,Saint-Pierre-du-Chemin,85,,,852640000B0830,,,,,,,,,,,,,0,,,,,P,prés,,,4800,-0.716182,46.68743
2020-1236003,2020-11-23,000002,Vente,26766.67,,,LE BEUGNON,B031,85120,85264,Saint-Pierre-du-Chemin,85,,,852640000B0955,,,,,,,,,,,,,0,,,,,P,prés,,,3680,-0.716076,46.687055
2020-1236003,2020-11-23,000002,Vente,26766.67,,,LE BEUGNON,B031,85120,85264,Saint-Pierre-du-Chemin,85,,,852640000B0957,,,,,,,,,,,,,0,,,,,T,terres,,,7455,-0.715482,46.6878
2020-1236003,2020-11-23,000002,Vente,26766.67,,,LA TERRE ROUGE,B371,85120,85264,Saint-Pierre-du-Chemin,85,,,852640000B1080,,,,,,,,,,,,,0,,,,,T,terres,,,22682,-0.711697,46.685296
2020-1236003,2020-11-23,000002,Vente,26766.67,,,LE CHAMP DU BOURG NEUF,B097,85120,85264,Saint-Pierre-du-Chemin,85,,,852640000C0898,,,,,,,,,,,,,0,,,,,T,terres,,,7600,-0.703127,46.690759
2020-1236060,2020-11-26,000001,Vente,3000,,,LE GRELET,B200,85120,85264,Saint-Pierre-du-Chemin,85,,,852640000A0787,,,,,,,,,,,,,0,,,,,T,terres,,,11500,-0.732115,46.697716
2020-1236101,2020-11-30,000001,Vente,5000,,,LA PLOCHERE,B299,85120,85264,Saint-Pierre-du-Chemin,85,,,852640000C0893,,,,,,,,,,,,,0,,,,,S,sols,,,7,-0.705403,46.691123
2020-1236101,2020-11-30,000001,Vente,5000,,,LA PLOCHERE,B299,85120,85264,Saint-Pierre-du-Chemin,85,,,852640000C0999,,,,,,,,,,,,,0,,,,,T,terres,,,3420,-0.705418,46.690484
2020-1236101,2020-11-30,000001,Vente,5000,,,LA PLOCHERE,B299,85120,85264,Saint-Pierre-du-Chemin,85,,,852640000C1049,,,,,,,,,,,,,0,,,,,J,jardins,,,455,-0.705306,46.691031
2020-1236101,2020-11-30,000001,Vente,5000,,,LA PLOCHERE,B299,85120,85264,Saint-Pierre-du-Chemin,85,,,852640000C1216,,,,,,,,,,,,,0,,,,,J,jardins,,,118,-0.70569,46.690591
2020-1236101,2020-11-30,000001,Vente,5000,,,LA PLOCHERE,B299,85120,85264,Saint-Pierre-du-Chemin,85,,,852640000C1216,,,,,,,,,,,,,0,,,,,S,sols,,,93,-0.70569,46.690591
2020-1236102,2020-11-30,000002,Vente,135000,21,,RUE DES PLOCHERES,0104,85120,85264,Saint-Pierre-du-Chemin,85,,,852640000C0892,,,,,,,,,,,,,0,1,Maison,113,5,S,sols,,,620,-0.705515,46.690732
2020-1236102,2020-11-30,000002,Vente,135000,,,LA PLOCHERE,B299,85120,85264,Saint-Pierre-du-Chemin,85,,,852640000C1048,,,,,,,,,,,,,0,,,,,J,jardins,,,380,-0.705447,46.690906
2020-1236102,2020-11-30,000002,Vente,135000,,,LA PLOCHERE,B299,85120,85264,Saint-Pierre-du-Chemin,85,,,852640000C1215,,,,,,,,,,,,,0,,,,,S,sols,,,34,-0.705632,46.690638
2020-1236115,2020-12-10,000001,Vente,10000,,,LA GOURMAUDIERE,B179,85120,85264,Saint-Pierre-du-Chemin,85,,,852640000B0429,,,,,,,,,,,,,0,,,,,J,jardins,,,260,-0.716665,46.699232
2020-1236115,2020-12-10,000001,Vente,10000,,,LA GOURMAUDIERE,B179,85120,85264,Saint-Pierre-du-Chemin,85,,,852640000B0430,,,,,,,,,,,,,0,,,,,S,sols,,,53,-0.716555,46.699096
2020-1236115,2020-12-10,000001,Vente,10000,,,LA GOURMAUDIERE,B179,85120,85264,Saint-Pierre-du-Chemin,85,,,852640000B0431,,,,,,,,,,,,,0,,,,,J,jardins,,,360,-0.716542,46.699063
2020-1236115,2020-12-10,000001,Vente,10000,,,LA GOURMAUDIERE,B179,85120,85264,Saint-Pierre-du-Chemin,85,,,852640000B0946,,,,,,,,,,,,,0,,,,,J,jardins,,,1024,-0.716797,46.699019
2020-1236115,2020-12-10,000001,Vente,10000,,,LA GOURMAUDIERE,B179,85120,85264,Saint-Pierre-du-Chemin,85,,,852640000B0947,,,,,,,,,,,,,0,,,,,J,jardins,,,196,-0.716672,46.698891
2020-1236134,2020-11-27,000001,Vente,4000,,,LES MARIOCHES,B231,85120,85264,Saint-Pierre-du-Chemin,85,,,852640000C1199,,,,,,,,,,,,,0,,,,,T,terres,,,1675,-0.678613,46.695172
2020-1236134,2020-11-27,000001,Vente,4000,,,LES MARIOCHES,B231,85120,85264,Saint-Pierre-du-Chemin,85,,,852640000C1199,,,,,,,,,,,,,0,,,,,S,sols,,,1000,-0.678613,46.695172
2020-1236135,2020-12-02,000001,Vente,14586.56,,,LE BOURG,B052,85120,85264,Saint-Pierre-du-Chemin,85,,,85264000AB0879,,,,,,,,,,,,,0,,,,,AB,terrains a bâtir,,,632,-0.697792,46.696146
2020-1236386,2020-12-16,000001,Vente,90000,,,LES NOUES,B258,85120,85264,Saint-Pierre-du-Chemin,85,,,852640000B0101,,,,,,,,,,,,,0,,,,,T,terres,,,5330,-0.679343,46.720052
2020-1236386,2020-12-16,000001,Vente,90000,,,LES NOUES,B258,85120,85264,Saint-Pierre-du-Chemin,85,,,852640000B0102,,,,,,,,,,,,,0,,,,,T,terres,,,5030,-0.679613,46.720472
2020-1236386,2020-12-16,000001,Vente,90000,5322,,LA MIGNONNIERE,B241,85120,85264,Saint-Pierre-du-Chemin,85,,,852640000B0121,,,,,,,,,,,,,0,1,Maison,110,4,S,sols,,,77,-0.680489,46.719762
2020-1236386,2020-12-16,000001,Vente,90000,,,LA MIGNONNIERE,B241,85120,85264,Saint-Pierre-du-Chemin,85,,,852640000B1220,,,,,,,,,,,,,0,,,,,S,sols,,,312,-0.680293,46.719749
2020-1236386,2020-12-16,000001,Vente,90000,,,LES MARTINIERES,B233,85120,85264,Saint-Pierre-du-Chemin,85,,,852640000B1256,,,,,,,,,,,,,0,,,,,T,terres,,,1120,-0.680197,46.719854
2020-1236386,2020-12-16,000001,Vente,90000,,,LA MIGNONNIERE,B241,85120,85264,Saint-Pierre-du-Chemin,85,,,852640000B1437,,,,,,,,,,,,,0,,,,,J,jardins,,,1256,-0.6803,46.719599
2020-1236386,2020-12-16,000001,Vente,90000,6,,LA MIGNONNIERE,B241,85120,85264,Saint-Pierre-du-Chemin,85,,,852640000B1439,,,,,,,,,,,,,0,,,,,S,sols,,,721,-0.680644,46.71969
